program: Orca
programVersion: 5.0.2
elementType: S F F F F F F O O O O N N N N N C C C C C C C C C C C C C H H H H H H H H H
charge: 0
multiplicity: 1
keywords: wb97x-d3
keywords: def2-TZVPP
keywords: def2/J RIJCOSX
keywords: DEFGRID2
keywords: scfconv7
keywords: smallprint printgap noloewdin
keywords: NOSOSCF
formula: C13H9F6N5O4S
38 atoms
S  2.399609 1.214467 -0.972798
F  2.871755 -1.134618 2.924011
F  3.472593 0.8579 2.413456
F  1.578113 0.079107 1.737814
F  -5.584945 -1.648908 -1.267967
F  -5.741546 -1.465218 0.870647
F  -6.363433 0.157459 -0.400864
O  2.71302 1.618033 -2.326515
O  2.476833 2.198428 0.087075
O  1.065164 -0.887049 -2.561528
O  -2.526688 2.263975 1.554418
N  0.822703 0.665565 -0.924765
N  -0.963938 -0.675482 -1.611116
N  -3.140941 -0.74427 -0.946223
N  -1.677545 0.835011 -0.00006
N  -3.926389 0.775533 0.67695
C  3.401784 -0.210313 -0.581001
C  3.539661 -0.758468 0.704245
C  4.097731 -0.752143 -1.651672
C  4.388013 -1.843664 0.867801
C  2.860797 -0.230925 1.942068
C  4.936801 -1.839906 -1.465194
C  5.08058 -2.384863 -0.205647
C  0.366285 -0.3195 -1.751293
C  -1.946103 -0.168424 -0.817852
C  -4.062321 -0.215224 -0.174663
C  -2.693878 1.273223 0.724462
C  -5.456645 -0.805778 -0.25361
C  -1.237163 2.879831 1.660265
H  3.997171 -0.335179 -2.642209
H  4.526084 -2.286685 1.843109
H  0.181822 1.100305 -0.251964
H  5.471102 -2.251673 -2.309656
H  5.733208 -3.231397 -0.0434
H  -1.248786 -1.431566 -2.223675
H  -1.355096 3.672474 2.392445
H  -0.926805 3.308213 0.708215
H  -0.488529 2.170633 2.010753
elementType: S F O N C H
totalener: -2073.01260162 hartree
nucrepener: 3250.50221165 hartree
electener: -5323.51481327 hartree
oneelecener: -9321.16060293 hartree
twoeener: 3997.64578966 hartree
cpcmener: -0.04724861 hartree
kineticenergy: 2066.15229515 hartree
xcener: -163.688850727605 hartree
chargesum: -0.0000000
charge: 0.889468 -0.173836 -0.170588 -0.177851 -0.161516 -0.167100 -0.164921 -0.500764 -0.508567 -0.474307 -0.263779 -0.204726 -0.129215 -0.379011 -0.413020 -0.353996 -0.125017 -0.046344 -0.006164 -0.126338 0.547800 -0.162190 -0.105234 0.397896 0.428648 0.233928 0.471984 0.493550 -0.120655 0.153881 0.150397 0.246660 0.168212 0.169914 0.201712 0.140978 0.124180 0.115932
qa: 0.8895 -0.1738 -0.1706 -0.1779 -0.1615 -0.1671 -0.1649 -0.5008 -0.5086 -0.4743 -0.2638 -0.2047 -0.1292 -0.3790 -0.4130 -0.3540 -0.1250 -0.0463 -0.0062 -0.1263 0.5478 -0.1622 -0.1052 0.3979 0.4286 0.2339 0.4720 0.4936 -0.1207 0.1539 0.1504 0.2467 0.1682 0.1699 0.2017 0.1410 0.1242 0.1159
va: 5.8007 1.1310 1.1222 1.1223 1.1515 1.1378 1.1428 1.9987 1.9802 2.0406 2.1652 3.1155 3.2364 3.0053 2.9732 3.0137 3.8383 3.7588 3.8203 3.9546 4.4090 3.9650 3.8965 4.3810 4.1962 4.0772 4.2194 4.5260 3.8403 1.0182 1.0081 1.0086 0.9867 0.9853 1.0110 0.9945 0.9922 0.9973
dispcorr: -0.020475646 hartree
energy: -2073.033077268949
dipole: 23.88106 -22.39515 1.48591 3.57215 -5.13120 -1.55905 -6.23179 6.83152 0.59973
magnitude: 2.23568 au
magnitude: 5.68263 debye
