program: Orca
programVersion: 5.0.2
elementType: S F F F F F F O O O O N N N N N C C C C C C C C C C C C C H H H H H H H H H
charge: 0
multiplicity: 1
keywords: wb97x-d3
keywords: def2-TZVPP
keywords: def2/J RIJCOSX
keywords: DEFGRID2
keywords: scfconv7
keywords: smallprint printgap noloewdin
keywords: NOSOSCF
formula: C13H9F6N5O4S
InChI: InChI=1S/C13H9F6N5O4S/c1-28-11-21-8(13(17,18)19)20-9(23-11)22-10(25)24-29(26,27)7-5-3-2-4-6(7)12(14,15)16/h2-5,22,24H,1H3
38 atoms
S  1.977673 0.037491 1.538758
F  1.295376 1.280238 -1.170329
F  2.933083 2.618118 -0.745497
F  2.76998 1.68333 -2.661855
F  -4.274072 2.568025 -0.045495
F  -2.939409 2.208778 1.604343
F  -2.142927 2.565862 -0.361753
O  1.800883 1.473096 1.609772
O  2.278997 -0.695208 2.750195
O  1.155635 -2.708702 0.844093
O  -5.314333 -1.891957 -1.006256
N  0.536213 -0.528046 0.914773
N  -0.962225 -2.202105 0.277016
N  -2.023939 -0.131863 0.273236
N  -3.139603 -2.098092 -0.366921
N  -4.277896 -0.031783 -0.386202
C  3.227978 -0.374102 0.33379
C  3.436313 0.316085 -0.871129
C  4.066649 -1.416743 0.699081
C  4.501459 -0.071166 -1.671479
C  2.602635 1.476508 -1.354016
C  5.122168 -1.788367 -0.11838
C  5.341202 -1.111682 -1.30078
C  0.308243 -1.855738 0.699359
C  -2.069376 -1.440731 0.057948
C  -3.161966 0.494288 0.03427
C  -4.206195 -1.356254 -0.577303
C  -3.138386 1.984457 0.305378
C  -5.359872 -3.299051 -1.263634
H  3.913881 -1.948372 1.625782
H  4.698147 0.438933 -2.602916
H  -0.219378 0.149041 0.75911
H  5.766999 -2.6023 0.18157
H  6.163597 -1.38565 -1.946777
H  -1.07682 -3.194251 0.103202
H  -5.178849 -3.871362 -0.355619
H  -4.639423 -3.582528 -2.028509
H  -6.36581 -3.494672 -1.621483
elementType: S F O N C H
totalener: -2073.01175779 hartree
nucrepener: 3278.44800589 hartree
electener: -5351.45976368 hartree
oneelecener: -9378.58359595 hartree
twoeener: 4027.12383227 hartree
cpcmener: -0.04906597 hartree
kineticenergy: 2066.16698195 hartree
xcener: -163.691091852328 hartree
chargesum: 0.0000000
charge: 0.886966 -0.176571 -0.169273 -0.174120 -0.159377 -0.168136 -0.166922 -0.507857 -0.501661 -0.475911 -0.263350 -0.197379 -0.131271 -0.406235 -0.400013 -0.337634 -0.119595 -0.049491 -0.006602 -0.124650 0.543509 -0.165363 -0.104949 0.401679 0.426986 0.221315 0.488395 0.501865 -0.115724 0.153264 0.149889 0.227215 0.167934 0.169637 0.202571 0.123127 0.122952 0.134778
qa: 0.8870 -0.1766 -0.1693 -0.1741 -0.1594 -0.1681 -0.1669 -0.5079 -0.5017 -0.4759 -0.2634 -0.1974 -0.1313 -0.4062 -0.4000 -0.3376 -0.1196 -0.0495 -0.0066 -0.1246 0.5435 -0.1654 -0.1049 0.4017 0.4270 0.2213 0.4884 0.5019 -0.1157 0.1533 0.1499 0.2272 0.1679 0.1696 0.2026 0.1231 0.1230 0.1348
va: 5.8088 1.1212 1.1232 1.1299 1.1565 1.1373 1.1402 1.9809 1.9986 2.0399 2.1583 3.1084 3.2340 3.0297 2.9740 2.9959 3.8297 3.7652 3.8303 3.9518 4.4229 3.9668 3.8944 4.3772 4.1926 4.0804 4.2141 4.5051 3.8367 1.0190 1.0078 1.0400 0.9869 0.9853 1.0099 0.9935 0.9937 0.9939
dispcorr: -0.019389971 hartree
energy: -2073.031147760391
dipole: 4.87637 -5.10079 -0.22442 -30.31047 26.90769 -3.40278 -2.34119 -0.20282 -2.54401
magnitude: 4.25456 au
magnitude: 10.81423 debye
