program: Gaussian 09
title: 000074209
version: EM64L-G09RevD.01
frameworkgroup: C1[X(C14H24N2O8)]
method: RPBEPBE
basis: SDD
operation: Freq
keyword: #p
keyword: freq=noraman
keyword: PBEPBE/SDD
title: #p freq=noraman PBEPBE/SDD
converged: YES YES NO NO
title: Mulliken charges:
elementType: O O O O O O O O N N C C C C C C C C C C C C C C H H H H H H H H H H H H H H H H H H H H H H H H
charge: -0.419507 -0.417282 -0.416914 -0.418545 -0.223595 -0.228813 -0.227323 -0.225640 -0.107200 -0.113175 -0.356673 -0.352555 -0.398687 -0.434593 -0.354993 -0.368215 -0.436946 -0.419481 -0.423513 -0.425097 0.187645 0.189795 0.189039 0.185357 0.190452 0.178646 0.227275 0.206449 0.238530 0.186082 0.194474 0.207586 0.178631 0.231406 0.234736 0.187511 0.224557 0.294233 0.226211 0.266000 0.271251 0.229668 0.294314 0.224328 0.378916 0.382042 0.383647 0.379963
chargesum: 0.00000
title: Mulliken charges with hydrogens summed into heavy atoms:
elementType: O O O O O O O O N N C C C C C C C C C C C C C C
charge: -0.040591 -0.035240 -0.033267 -0.038582 -0.223595 -0.228813 -0.227323 -0.225640 -0.107200 -0.113175 0.012426 0.081170 0.025925 -0.032532 0.055045 0.054033 0.081844 0.072730 0.077405 0.093545 0.187645 0.189795 0.189039 0.185357
polarizability: 2.06694726e+02 4.20212377e+00 2.03538307e+02 5.64866611e-01 -7.74075811e-01 1.62692354e+02
1716.lowfreq: -3.1546 -0.0005 -0.0004 0.0003 2.5709 5.5538 6.0264 14.4763 17.6460
frequency: 5.9112 14.1779 17.5966 28.4950 32.2394 34.9153 36.6074 44.2717 46.9548 52.0287 57.4149 59.6669 77.2021 91.9642 107.8932 120.5729 169.4332 179.0041 193.3225 196.8267 218.2587 234.6647 250.9342 286.0926 288.9290 303.1646 309.6955 329.2209 335.2366 397.7183 418.3155 453.3467 472.1438 488.7822 490.0301 498.6963 505.1503 512.7829 550.5909 595.4812 599.9747 618.3070 619.2098 632.9674 633.7856 644.4347 647.7413 724.8262 748.6667 787.3682 818.3806 827.2266 850.5197 863.2621 871.4586 886.3383 894.6031 947.4224 967.0118 969.4708 979.9973 980.8253 1005.5261 1022.0558 1030.2924 1042.4084 1047.1762 1048.3537 1055.2173 1078.2039 1094.2415 1111.6418 1132.2866 1145.2176 1151.8879 1194.3197 1201.4520 1226.7607 1239.2392 1242.9776 1244.2333 1253.2608 1257.5347 1259.3539 1261.5347 1277.9216 1281.7424 1285.3901 1288.4061 1296.4287 1306.2905 1316.2907 1347.2144 1360.7129 1380.1152 1381.1857 1384.0143 1385.2771 1391.5775 1391.6732 1431.0494 1431.8224 1442.4747 1444.6282 1462.2816 1463.6343 1465.5141 1469.9980 1477.5299 1487.0321 1675.3512 1675.6691 1680.8615 1682.4648 2824.3986 2829.1435 2846.3460 2846.9087 2858.8361 2859.2262 2945.2818 2959.6407 2972.5852 2983.8316 2994.4774 3002.5879 3043.3024 3050.9255 3052.0424 3053.2410 3063.4943 3066.2155 3067.0505 3068.3922 3515.4968 3518.0315 3520.3051 3520.9831
redmass: 7.6958 7.5081 7.9413 5.9592 9.8346 10.1512 5.8250 9.7391 7.7342 2.9077 6.1699 4.0006 3.3654 2.8342 2.9712 2.1441 3.8390 2.9382 3.4226 4.0285 3.5934 2.9907 2.5731 5.1052 5.3728 2.8852 3.6268 2.8633 4.3520 3.8518 3.3536 3.0812 3.0190 2.0046 1.9394 2.0839 2.4096 3.4864 3.1911 3.6962 3.4862 1.9138 1.8200 1.5408 1.6776 2.2516 2.5230 1.0903 1.2435 2.1197 3.9089 2.0209 3.0727 3.9571 3.6207 1.8546 3.6647 2.0028 2.5011 1.9367 2.2201 2.2267 2.5813 2.9333 2.7458 3.1051 2.3980 2.4104 2.4612 2.1701 3.0536 1.9790 1.6478 2.3286 2.1145 1.8885 1.4721 1.3078 1.3075 1.3710 1.3670 1.3950 1.4927 1.4723 1.6279 1.7567 1.4081 1.3346 1.3115 1.3271 1.2570 1.3891 1.4778 1.6656 1.5671 1.6034 1.3687 1.3765 1.5660 1.5564 1.0962 1.0966 1.1065 1.1092 1.0800 1.0744 1.0933 1.0864 1.0959 1.0989 8.4071 8.3786 8.3623 8.3760 1.0712 1.0714 1.0716 1.0717 1.0702 1.0701 1.0589 1.0611 1.0659 1.0692 1.0878 1.0977 1.0957 1.0856 1.0854 1.0950 1.0885 1.0860 1.0899 1.0880 1.0641 1.0641 1.0641 1.0641
irintensity: 0.2118 0.4807 0.5347 0.2009 1.4811 0.1379 0.1911 0.9730 0.8370 0.5220 0.1255 0.5069 0.0171 0.0305 0.7269 0.0477 3.8768 0.6181 6.0646 6.7114 1.3654 1.5856 4.6086 2.8308 1.3093 7.0717 6.6983 4.3808 1.7810 2.0103 1.8112 30.0476 9.1267 33.5107 15.8057 45.5257 47.7455 31.0947 22.2747 10.7759 43.2937 85.7377 30.4013 168.8601 149.2763 51.2566 69.6387 7.1790 4.3056 11.7692 8.0643 11.8647 1.3350 0.2853 0.8489 1.9882 13.9633 24.8689 35.2506 72.5590 15.4893 19.7118 217.7459 186.9283 530.9341 137.4567 242.4515 61.4510 30.0363 0.0816 3.8659 2.3502 4.2939 46.7736 44.3761 3.5391 24.9042 12.2809 15.4132 10.7126 10.2904 13.6326 19.3027 3.4923 4.2110 6.8114 3.0680 3.8034 1.9706 12.1956 1.2368 8.2233 0.9667 1.9380 21.4200 21.0655 10.6805 3.5198 20.9099 15.0905 28.8789 26.5894 14.8848 16.9093 1.6905 1.4014 3.6228 3.2945 0.3318 26.3105 171.1105 232.0883 283.2804 177.9833 74.5520 67.8326 57.5639 71.1646 167.1157 125.7822 25.6386 44.7710 24.0621 29.9462 36.7832 16.6300 1.7505 10.1198 6.2284 45.8614 9.4701 3.0272 43.3017 49.1530 27.3384 29.3755 29.4510 26.4242
temp: 298.150 k
press: 1.00000 atm
elementType: 8 8 8 8 8 8 8 8 7 7 6 6 6 6 6 6 6 6 6 6 6 6 6 6 1 1 1 1 1 1 1 1 1 1 1 1 1 1 1 1 1 1 1 1 1 1 1 1
symmnumber: 1
zpe: 1006011.6 jmol-1
zpe.correction: 0.383170 hartree
zpe.thermalcorrener: 0.410916 hartree
zpe.thermalcorrenthalpy: 0.411860 hartree
zpe.thermalcorrgfe: 0.316198 hartree
zpe.sumelectzpe: -1257.265405 hartree
zpe.sumelectthermal: -1257.237659 hartree
zpe.sumelectthermalent: -1257.236714 hartree
zpe.sumelectthermalfe: -1257.332376 hartree
dipole: 1.2526 -0.0919 3.1706
dipole: 3.4103
quadrupole: -126.4298 -124.2277 -141.9790
quadrupole: -6.6708 -2.2230 -0.6300
quadrupole: 4.4491 6.6511 -11.1002 -6.6708 -2.2230 -0.6300
hfenergy: -1257.6485743 hartree
pointgroup: C01 [X(C14H24N2O8)]
dipole: 0.4994415 -0.0006467 1.2452839 debye
polarizability: 206.1477655|4.3677822|204.0847594|0.413748|-0.8807558|162.6928624 unknown
InChI: InChI=1S/C14H24N2O8/c17-11(18)7-15(8-12(19)20)5-3-1-2-4-6-16(9-13(21)22)10-14(23)24/h17,19,21,23H,1-10H2
charge 0 multiplicity 1
48 atoms
O  -5.8351 -3.173202 -0.001045
O  -5.042008 3.234755 -0.86001
O  4.367641 -3.165009 -1.351154
O  5.638904 3.190744 -0.820486
O  -3.593046 -2.834356 -0.503684
O  -5.545377 1.145874 -1.738732
O  4.327105 -1.03676 -2.278582
O  3.470977 2.885303 -0.04704
N  -3.852348 -0.059023 0.34543
N  4.077877 0.068078 0.432802
C  -0.226341 -0.295812 1.752002
C  1.150702 0.246335 1.310087
C  -1.369881 0.133337 0.80452
C  2.299902 -0.232779 2.222996
C  -2.742498 -0.382315 1.283663
C  3.676772 0.353791 1.837602
C  -4.996213 -0.976801 0.41517
C  -4.236133 1.356142 0.381065
C  4.385554 -1.347047 0.201247
C  5.097923 0.982194 -0.096611
C  -4.675042 -2.38053 -0.082507
C  -4.99652 1.831707 -0.852091
C  4.346025 -1.76461 -1.265025
C  4.59641 2.407897 -0.292599
H  -0.190255 -1.40498 1.797094
H  -0.446552 0.051832 2.784405
H  1.36342 -0.058387 0.267852
H  1.135551 1.35469 1.298531
H  -1.191658 -0.263062 -0.212192
H  -1.367237 1.23961 0.723076
H  2.329286 -1.342627 2.232983
H  2.097244 0.068524 3.271741
H  -2.953201 0.003924 2.314753
H  -2.682167 -1.481926 1.35352
H  3.616596 1.450909 1.937625
H  4.453341 -0.006268 2.561142
H  -5.432889 -1.084084 1.441168
H  -5.803071 -0.600096 -0.238008
H  -4.864842 1.633994 1.269126
H  -3.327423 1.976315 0.455587
H  3.645278 -1.970344 0.730053
H  5.38588 -1.665819 0.598641
H  5.416422 0.632765 -1.094493
H  6.021383 1.044596 0.534574
H  -5.629217 -4.083903 -0.345857
H  -5.563138 3.542514 -1.650605
H  4.366342 -3.43692 -2.30896
H  5.306424 4.117232 -0.967975
