program: Orca
programVersion: 5.0.2
elementType: S F F F F F F O O O O N N N N N C C C C C C C C C C C C C H H H H H H H H H
charge: 0
multiplicity: 1
keywords: wb97x-d3
keywords: def2-TZVPP
keywords: def2/J RIJCOSX
keywords: DEFGRID2
keywords: scfconv7
keywords: smallprint printgap noloewdin
keywords: NOSOSCF
formula: C13H9F6N5O4S
InChI: InChI=1S/C13H9F6N5O4S/c1-28-11-21-8(13(17,18)19)20-9(23-11)22-10(25)24-29(26,27)7-5-3-2-4-6(7)12(14,15)16/h2-5,22,24H,1H3
38 atoms
S  2.492529 0.22946 1.58757
F  2.836273 2.187276 -1.314003
F  2.163261 0.96836 -2.937531
F  1.091102 0.942618 -1.089839
F  -6.021163 0.296518 -0.905333
F  -4.881001 -1.169045 -1.989981
F  -5.673143 -1.646876 -0.047435
O  2.514076 1.670318 1.433956
O  3.028852 -0.360479 2.794921
O  1.150471 -2.421216 1.45927
O  -2.343286 2.74302 0.667135
N  0.878967 -0.166892 1.464241
N  -0.886803 -1.600015 0.951887
N  -2.969979 -1.129888 0.144151
N  -1.563456 0.615609 0.838525
N  -3.703456 1.10926 0.006995
C  3.302563 -0.556146 0.201522
C  3.189718 -0.142347 -1.136894
C  4.136567 -1.611311 0.539876
C  3.935472 -0.813337 -2.094574
C  2.320252 0.993888 -1.613175
C  4.873774 -2.266023 -0.434751
C  4.773948 -1.864702 -1.750653
C  0.4420 -1.450667 1.311954
C  -1.827115 -0.666106 0.638085
C  -3.839787 -0.184813 -0.14728
C  -2.520592 1.462693 0.50896
C  -5.12929 -0.674856 -0.77559
C  -1.083265 3.216195 1.161558
H  4.227082 -1.934119 1.565737
H  3.876476 -0.523571 -3.133096
H  0.214407 0.600488 1.304863
H  5.519392 -3.085807 -0.152919
H  5.343142 -2.363516 -2.52258
H  -1.167181 -2.564413 0.813471
H  -0.275849 2.960725 0.476618
H  -0.872591 2.818016 2.153035
H  -1.181143 4.295787 1.217925
elementType: S F O N C H
totalener: -2073.01115750 hartree
nucrepener: 3296.27104364 hartree
electener: -5369.28220114 hartree
oneelecener: -9412.60865176 hartree
twoeener: 4043.32645062 hartree
cpcmener: -0.04676823 hartree
kineticenergy: 2066.17125972 hartree
xcener: -163.692139103944 hartree
chargesum: -0.0000000
charge: 0.889542 -0.170784 -0.172536 -0.178535 -0.160671 -0.167153 -0.164642 -0.508718 -0.502646 -0.466890 -0.261135 -0.207283 -0.130152 -0.384421 -0.408782 -0.340619 -0.131642 -0.047669 -0.005679 -0.123241 0.547357 -0.161913 -0.101497 0.389467 0.420372 0.230216 0.476790 0.494358 -0.115326 0.156389 0.151575 0.237478 0.168287 0.170045 0.201602 0.111554 0.125864 0.141037
qa: 0.8895 -0.1708 -0.1725 -0.1785 -0.1607 -0.1672 -0.1646 -0.5087 -0.5026 -0.4669 -0.2611 -0.2073 -0.1302 -0.3844 -0.4088 -0.3406 -0.1316 -0.0477 -0.0057 -0.1232 0.5474 -0.1619 -0.1015 0.3895 0.4204 0.2302 0.4768 0.4944 -0.1153 0.1564 0.1516 0.2375 0.1683 0.1700 0.2016 0.1116 0.1259 0.1410
va: 5.8022 1.1212 1.1336 1.1193 1.1525 1.1370 1.1438 1.9810 1.9930 2.0475 2.1694 3.0969 3.2360 3.0369 2.9732 2.9882 3.8392 3.7545 3.8226 3.9527 4.3984 3.9627 3.8915 4.3882 4.2001 4.0829 4.2174 4.5300 3.8351 1.0163 1.0071 1.0308 0.9866 0.9852 1.0106 1.0005 0.9907 0.9949
dispcorr: -0.021315870 hartree
energy: -2073.032473374383
dipole: 24.36422 -23.17869 1.18553 -1.21130 0.56979 -0.64151 9.34889 -10.63598 -1.28709
magnitude: 1.86376 au
magnitude: 4.73731 debye
