program: Orca
programVersion: 5.0.2
elementType: S F F F F F F O O O O N N N N N C C C C C C C C C C C C C H H H H H H H H H
charge: 0
multiplicity: 1
keywords: wb97x-d3
keywords: def2-TZVPP
keywords: def2/J RIJCOSX
keywords: DEFGRID2
keywords: scfconv7
keywords: smallprint printgap noloewdin
keywords: NOSOSCF
formula: C13H9F6N5O4S
InChI: InChI=1S/C13H9F6N5O4S/c1-28-11-21-8(13(17,18)19)20-9(23-11)22-10(25)24-29(26,27)7-5-3-2-4-6(7)12(14,15)16/h2-5,22,24H,1H3
38 atoms
S  2.349221 0.141958 1.45875
F  3.473732 2.317701 -1.183285
F  2.899359 1.246848 -2.947164
F  1.590259 1.271646 -1.263311
F  -6.373318 -0.177294 0.577009
F  -5.886698 -0.264573 -1.518045
F  -5.651712 -2.012219 -0.283772
O  2.403816 1.588858 1.406686
O  2.650444 -0.528806 2.705095
O  1.017416 -2.490244 1.086696
O  -2.47507 2.693796 0.389962
N  0.787419 -0.230783 1.009468
N  -1.00685 -1.652039 0.563632
N  -3.198722 -1.192044 0.133026
N  -1.675812 0.566377 0.46667
N  -3.938752 1.048123 0.070814
C  3.390581 -0.568278 0.195496
C  3.561518 -0.035421 -1.092725
C  4.093639 -1.699067 0.585811
C  4.452813 -0.665737 -1.948755
C  2.876611 1.203396 -1.613396
C  4.977078 -2.313417 -0.28806
C  5.156468 -1.794952 -1.554209
C  0.327846 -1.511376 0.907315
C  -1.979142 -0.717769 0.383331
C  -4.105486 -0.25244 -0.007804
C  -2.68211 1.409884 0.310132
C  -5.52337 -0.693774 -0.308838
C  -1.147474 3.172295 0.641836
H  3.967581 -2.111541 1.57523
H  4.617009 -0.282092 -2.944886
H  0.140056 0.546015 0.826503
H  5.517353 -3.193148 0.032517
H  5.843712 -2.26085 -2.246513
H  -1.309363 -2.616481 0.484519
H  -1.233677 4.253456 0.685197
H  -0.470545 2.895175 -0.16496
H  -0.767064 2.799785 1.592043
elementType: S F O N C H
totalener: -2073.01253505 hartree
nucrepener: 3250.61913311 hartree
electener: -5323.63166816 hartree
oneelecener: -9321.37317197 hartree
twoeener: 3997.74150381 hartree
cpcmener: -0.04693080 hartree
kineticenergy: 2066.15956140 hartree
xcener: -163.690626787524 hartree
chargesum: -0.0000000
charge: 0.889722 -0.171458 -0.173706 -0.177884 -0.165551 -0.166858 -0.161497 -0.509709 -0.501034 -0.472212 -0.263778 -0.205305 -0.129990 -0.378282 -0.409763 -0.353741 -0.120713 -0.048079 -0.008894 -0.126578 0.548203 -0.163136 -0.106387 0.397476 0.425455 0.236890 0.472366 0.494248 -0.122351 0.155436 0.151049 0.244146 0.168694 0.169982 0.201497 0.140831 0.118935 0.121977
qa: 0.8897 -0.1715 -0.1737 -0.1779 -0.1656 -0.1669 -0.1615 -0.5097 -0.5010 -0.4722 -0.2638 -0.2053 -0.1300 -0.3783 -0.4098 -0.3537 -0.1207 -0.0481 -0.0089 -0.1266 0.5482 -0.1631 -0.1064 0.3975 0.4255 0.2369 0.4724 0.4942 -0.1224 0.1554 0.1510 0.2441 0.1687 0.1700 0.2015 0.1408 0.1189 0.1220
va: 5.8010 1.1210 1.1309 1.1229 1.1422 1.1387 1.1521 1.9784 1.9987 2.0440 2.1658 3.1118 3.2376 3.0019 2.9781 3.0165 3.8366 3.7609 3.8255 3.9574 4.4088 3.9647 3.8969 4.3827 4.2029 4.0743 4.2159 4.5260 3.8401 1.0172 1.0077 1.0158 0.9865 0.9852 1.0109 0.9950 0.9975 0.9931
dispcorr: -0.020594689 hartree
energy: -2073.033129740923
dipole: 24.48494 -22.89728 1.58767 -2.14536 1.44236 -0.70300 6.05989 -7.68180 -1.62191
magnitude: 2.37602 au
magnitude: 6.03937 debye
