program: Gaussian 09
title: 000069106
version: EM64L-G09RevD.01
frameworkgroup: C1[X(C6H4Br3N)]
method: RPBEPBE
basis: SDD
operation: Freq
keyword: #p
keyword: freq=noraman
keyword: PBEPBE/SDD
title: #p freq=noraman PBEPBE/SDD
converged: NO NO NO NO
title: Mulliken charges:
elementType: Br Br Br N C C C C C C H H H H
charge: 0.050807 0.064573 0.022952 -0.692445 0.662074 -0.404179 -0.361924 -0.130136 -0.164771 -0.219430 0.249719 0.278623 0.326301 0.317837
chargesum: 0.00000
title: Mulliken charges with hydrogens summed into heavy atoms:
elementType: Br Br Br N C C C C C C
charge: 0.050807 0.064573 0.022952 -0.048306 0.662074 -0.404179 -0.112206 -0.130136 -0.164771 0.059193
polarizability: 1.84816882e+02 8.67066654e-01 1.37200650e+02 -7.18196281e-04 1.00776225e-02 4.18256059e+01
1716.lowfreq: -0.0003 0.0001 0.0002 4.6114 8.5728 10.9563 56.8528 119.5519 124.1059
frequency: 56.8452 119.5519 124.1027 136.9008 202.9183 205.6056 255.8916 282.8527 289.3417 410.1165 421.4376 449.6972 495.5889 522.8778 546.4168 570.2598 708.4507 729.3153 833.1279 850.1030 897.1859 990.1773 1049.5119 1109.1519 1187.7621 1288.6268 1363.5821 1410.6710 1444.7548 1536.1678 1588.9653 1630.7013 3155.1792 3187.2887 3547.0209 3695.5632
redmass: 10.8631 38.8933 7.3431 32.3008 62.4309 4.0165 5.1957 5.4250 10.4424 1.1450 8.3238 1.1737 3.3897 4.3678 7.0106 4.5343 3.4815 10.2283 1.4160 1.6566 8.5749 5.1150 1.6795 1.7003 2.0295 1.7484 7.6006 3.0973 5.6672 7.1013 4.7052 1.2799 1.0925 1.0932 1.0457 1.1036
irintensity: 0.7060 0.0583 2.8954 0.2280 0.0420 1.2218 4.1938 12.6927 3.0875 64.9668 11.5504 217.3962 0.6066 1.1216 7.1379 21.9612 0.7302 35.2561 12.6294 50.1214 83.2374 48.2980 67.1487 22.4054 7.6825 0.0990 38.6269 42.6292 58.2418 101.8767 134.7519 292.7065 3.0990 1.5803 80.2935 40.0922
temp: 298.150 k
press: 1.00000 atm
elementType: 35 35 35 7 6 6 6 6 6 6 1 1 1 1
symmnumber: 1
zpe: 223065.9 jmol-1
zpe.correction: 0.084961 hartree
zpe.thermalcorrener: 0.095342 hartree
zpe.thermalcorrenthalpy: 0.096286 hartree
zpe.thermalcorrgfe: 0.046082 hartree
zpe.sumelectzpe: -325.448725 hartree
zpe.sumelectthermal: -325.438345 hartree
zpe.sumelectthermalent: -325.437401 hartree
zpe.sumelectthermalfe: -325.487605 hartree
dipole: 0.1128 3.4697 0.0012
dipole: 3.4716
quadrupole: -87.6602 -69.0799 -90.5967
quadrupole: 0.7732 0.0004 0.0059
quadrupole: -5.2146 13.3657 -8.1511 0.7732 0.0004 0.0059
hfenergy: -325.5336867 hartree
pointgroup: C01 [X(C6H4Br3N1)]
dipole: -0.1527715 -1.3572429 0.0004823 debye
dipolederiv: -0.5893689 -0.0837093 0.0000039 -0.1019701 -0.0440733 0.0000118 -0.0000021 0.0000086 0.009078 -0.1861628 0.2645499 -0.0000225 0.2968426 -0.4599303 0.0000432 -0.0000264 0.0000415 -0.000186 -0.7487277 -0.0259416 0.0000169 -0.0355687 -0.07127 0.0000066 0.0000171 0.0000075 -0.0275309 -0.3887847 -0.4606778 0.0000344 -0.4458508 -1.3190698 -0.0000787 -0.0000433 -0.0003374 -0.7032595 0.0523858 0.5029233 -0.0000256 0.3671237 1.3213182 -0.000025 -0.0000316 -0.00004 0.2031958 0.8726232 0.513577 -0.0000385 -0.1751101 -0.6174319 0.0000285 0.0000694 0.0000591 -0.1766535 -0.4534619 -0.5222975 0.0000528 0.1292475 -0.2855562 0.0000134 -0.0000135 0.0000227 -0.1819917 0.4601682 -0.5992727 0.0000519 -0.0575876 0.9401529 -0.0000808 -0.0000222 -0.0000826 -0.0359341 1.3764578 0.1306993 -0.0000408 -0.1569066 0.4841699 -0.0000594 -0.0000163 -0.0000643 -0.084674 -0.8191711 0.2266 -0.0000205 0.1139932 -0.4569245 0.0000176 -0.0000031 0.0000212 -0.1208403 0.0340784 0.0474599 -0.0000078 0.0555719 -0.0316303 0.0000238 -0.000001 0.0000157 0.1784372 0.0607595 -0.0373924 0.000007 -0.0273517 0.027883 0.0000202 0.0000115 0.000023 0.1788096 0.2084113 0.0293518 0.0000264 -0.0052874 0.261532 0.0000228 0.0000777 0.0001232 0.3771583 0.1207928 0.0141301 -0.0000376 0.0428541 0.2508305 0.000056 -0.0000162 0.000202 0.3843912 unknown
polarizability: 184.6532767|-2.9181031|137.3642556|-0.0000854|-0.0101028|41.8256059 unknown
InChI: InChI=1S/C6H4Br3N/c7-3-1-4(8)6(9)5(10)2-3/h1-2H,10H2
charge 0 multiplicity 1
14 atoms
Br -3.050642 -0.344265 0.000057
Br -1.549648 2.779659 -0.000229
Br 3.643839 0.271132 -0.000047
N  -0.869613 -2.585232 0.000251
C  -0.299352 -1.321315 0.00019
C  -1.104949 -0.137618 0.000064
C  1.120676 -1.178153 0.000178
C  -0.494375 1.136805 -0.000079
C  1.693204 0.103174 0.000016
C  0.911652 1.277856 -0.000111
H  1.750796 -2.073133 0.000264
H  1.371145 2.268298 -0.000244
H  -1.881336 -2.693447 0.000439
H  -0.280896 -3.412862 0.000653
