program: Gaussian 09
title: 000074103
version: EM64L-G09RevD.01
frameworkgroup: C1[X(C7H4F2O2)]
method: RPBEPBE
basis: SDD
operation: Freq
keyword: #pfreq=noraman
keyword: PBEPBE/SDD
title: #p freq=noraman PBEPBE/SDD
converged: NO NO NO NO
title: Mulliken charges:
elementType: F F O O C C C C C C C H H H H
charge: -0.130688 -0.130734 -0.228963 -0.228966 0.223255 0.223254 0.304012 -0.317312 -0.317306 -0.202311 -0.202313 0.264528 0.264526 0.239510 0.239511
chargesum: 0.00000
title: Mulliken charges with hydrogens summed into heavy atoms:
elementType: F F O O C C C C C C C
charge: -0.130688 -0.130734 -0.228963 -0.228966 0.223255 0.223254 0.304012 -0.052785 -0.052781 0.037198 0.037198
polarizability: 1.09927157e+02 -1.08089961e-04 7.94202687e+01 2.61730282e-04 1.09643829e-03 3.89445249e+01
1716.lowfreq: -6.8402 -0.0011 -0.0007 0.0002 13.2113 18.1071 58.0343 173.2112 255.3616
frequency: 57.7795 173.2027 255.3615 286.7640 333.6121 345.8793 413.8746 521.0786 531.5455 544.8260 555.8502 600.5652 636.9715 701.2472 751.1402 760.3168 814.3941 829.5232 852.0538 893.6442 929.9866 974.2898 1004.5475 1037.6167 1091.1498 1114.3597 1144.8016 1166.0816 1229.2778 1275.5447 1407.0037 1451.2914 1456.3431 1610.9400 1637.5804 3147.4173 3165.3348 3185.1998 3190.3608
redmass: 11.0126 6.1305 6.3737 6.8101 14.2666 12.5629 3.0461 16.9807 9.9909 4.2584 10.0074 7.4814 11.7065 5.0089 1.2079 9.7582 9.1699 9.1345 1.3154 9.4383 1.3708 1.2972 2.0435 12.8697 2.2980 11.7055 2.5013 1.1376 3.1356 1.4141 6.4932 2.4662 2.9662 8.1856 8.1809 1.0870 1.0930 1.0957 1.0990
irintensity: 0.0140 0.0000 1.9220 0.0119 0.0000 13.9460 7.0236 0.4490 0.0054 0.0000 2.9008 0.1870 23.9767 0.0000 113.8776 2.9748 46.0794 3.3277 0.0000 77.2729 2.9761 0.0000 22.5183 287.2264 32.7760 859.7121 6.4171 18.1361 74.4026 1.3275 1.4913 5.7806 141.3488 2.3052 4.0038 2.5567 12.0083 1.9068 1.5380
temp: 298.150 k
press: 1.00000 atm
elementType: 9 9 8 8 6 6 6 6 6 6 6 1 1 1 1
symmnumber: 1
zpe: 251686.9 jmol-1
zpe.correction: 0.095862 hartree
zpe.thermalcorrener: 0.104025 hartree
zpe.thermalcorrenthalpy: 0.104969 hartree
zpe.thermalcorrgfe: 0.062357 hartree
zpe.sumelectzpe: -618.469155 hartree
zpe.sumelectthermal: -618.460992 hartree
zpe.sumelectthermalent: -618.460048 hartree
zpe.sumelectthermalfe: -618.502661 hartree
dipole: -4.4999 0.0001 -0.0003
dipole: 4.4999
quadrupole: -58.9181 -57.0741 -65.6010
quadrupole: 0.0001 -0.0009 0.0002
quadrupole: 1.6130 3.4570 -5.0699 0.0001 -0.0009 0.0002
hfenergy: -618.5650177 hartree
pointgroup: C01 [X(C7H4F2O2)]
dipole: 1.7703869 -0.0000251 -0.0001208 debye
dipolederiv: -0.8103936 -0.0000064 -0.2564372 -0.0000102 -0.2403303 -0.0000111 -0.4162948 -0.0000119 -0.6406883 -0.8101839 0.0000123 0.2564196 0.0000167 -0.2403726 -0.0000163 0.4165233 -0.0000155 -0.6409837 -1.4881267 -0.0063063 0.0000558 0.2666395 -0.4379372 -0.0000536 0.0000502 -0.0000109 -0.2930675 -1.4881078 0.0063154 0.0000479 -0.266618 -0.4379244 0.0000635 0.0000783 0.0000198 -0.2930635 0.9259627 0.1188864 -0.0000018 0.5625151 0.0662491 -0.0000176 -0.0000058 -0.0000126 0.0446878 0.9259532 -0.1189021 0.0000142 -0.5625248 0.0662432 0.0000164 0.0000307 0.0000175 0.0446864 2.7778784 -0.0000081 -0.000104 -0.0000173 1.0411148 0.0000233 -0.0003927 0.0000182 1.6668263 -0.1031617 -0.0304571 -0.0000031 -0.0044189 0.0662592 -0.0000098 0.0000062 -0.0000056 -0.1354056 -0.1031654 0.0304697 -0.0000038 0.0044163 0.06627 -0.0000052 0.0000043 -0.0000057 -0.1354043 0.0314094 -0.0160632 0.000017 -0.0826361 -0.0057679 -0.0000035 0.0000175 -0.0000169 -0.1636823 0.0314123 0.0160588 0.0000154 0.0826373 -0.0057608 -0.0000042 0.0000022 0.0000009 -0.1636819 0.1065312 -0.0147097 -0.0000008 -0.0084907 -0.0166377 0.0000062 0.0000016 0.0000103 0.1851447 0.106529 0.0147088 -0.0000041 0.0084888 -0.0166464 0.0000048 0.0000006 0.0000026 0.1851426 -0.0512695 0.0763826 -0.0000108 0.0738551 0.0476188 0.000007 -0.0000157 0.0000099 0.1697446 -0.0512677 -0.0763811 -0.0000046 -0.0738529 0.0476222 0. -0.0000058 0. 0.1697446 unknown
polarizability: 109.9271574|-0.0001904|79.4202687|-0.0002617|-0.0010964|38.9445249 unknown
InChI: InChI=1S/C7H4F2O2/c8-7(9)10-5-3-1-2-4-6(5)11-7/h1-4H
charge 0 multiplicity 1
15 atoms
F  -2.704038 -0.000028 -1.120075
F  -2.703488 0.000047 1.120673
O  -1.022054 -1.177311 -0.0001
O  -1.022046 1.17733 -0.000186
C  0.329537 -0.703925 -0.00007
C  0.329535 0.703939 -0.000127
C  -1.850603 0.0000 0.000055
C  1.504736 -1.454763 -0.000024
C  1.504747 1.454753 -0.0001
C  2.715605 -0.708375 -0.000014
C  2.71561 0.708365 -0.000049
H  1.491216 -2.547397 0.000014
H  1.491238 2.547388 -0.000118
H  3.668547 -1.247096 0.000049
H  3.668558 1.247074 -0.000027
