program: Orca
programVersion: 5.0.2
elementType: S F F F F F F O O O O N N N N N C C C C C C C C C C C C C H H H H H H H H H
charge: 0
multiplicity: 1
keywords: wb97x-d3
keywords: def2-TZVPP
keywords: def2/J RIJCOSX
keywords: DEFGRID2
keywords: scfconv7
keywords: smallprint printgap noloewdin
keywords: NOSOSCF
formula: C13H9F6N5O4S
InChI: InChI=1S/C13H9F6N5O4S/c1-28-11-21-8(13(17,18)19)20-9(23-11)22-10(25)24-29(26,27)7-5-3-2-4-6(7)12(14,15)16/h2-5,22,24H,1H3
38 atoms
S  2.358051 0.151037 1.470208
F  3.456301 2.314496 -1.165461
F  2.896227 1.255878 -2.941488
F  1.576109 1.261976 -1.266358
F  -6.371599 -0.166338 0.533619
F  -5.853727 -0.30279 -1.550675
F  -5.631878 -2.020972 -0.270304
O  2.399716 1.596378 1.41044
O  2.66543 -0.520344 2.712466
O  1.026568 -2.489562 1.091403
O  -2.475855 2.697324 0.395109
N  0.798171 -0.230579 1.017093
N  -0.994217 -1.646459 0.560362
N  -3.181654 -1.187998 0.119957
N  -1.668107 0.57362 0.471497
N  -3.931416 1.046769 0.069573
C  3.395288 -0.561902 0.202017
C  3.550946 -0.038693 -1.09173
C  4.099617 -1.692468 0.590501
C  4.425939 -0.679848 -1.956981
C  2.865858 1.202517 -1.607297
C  4.966796 -2.317541 -0.291856
C  5.128483 -1.810374 -1.56502
C  0.340468 -1.51132 0.912953
C  -1.965168 -0.712399 0.379885
C  -4.093049 -0.253136 -0.016546
C  -2.677416 1.414064 0.312713
C  -5.508056 -0.702356 -0.326185
C  -1.153948 3.182554 0.6564
H  3.98326 -2.096688 1.584981
H  4.57619 -0.30421 -2.95858
H  0.149978 0.545177 0.839304
H  5.507619 -3.198262 0.026351
H  5.800897 -2.286934 -2.265259
H  -1.301824 -2.608793 0.474666
H  -1.245115 4.264164 0.691647
H  -0.465793 2.905155 -0.141131
H  -0.780327 2.819863 1.613624
elementType: S F O N C H
totalener: -2073.01704067 hartree
nucrepener: 3252.09171994 hartree
electener: -5325.10876061 hartree
oneelecener: -9324.35466762 hartree
twoeener: 3999.24590701 hartree
cpcmener: -0.03923366 hartree
kineticenergy: 2066.17641618 hartree
xcener: -163.691374550999 hartree
chargesum: -0.0000000
charge: 0.880527 -0.168127 -0.174205 -0.178795 -0.163979 -0.165996 -0.160715 -0.497314 -0.486415 -0.445932 -0.255525 -0.207617 -0.134502 -0.376289 -0.412951 -0.346573 -0.124432 -0.051707 -0.004355 -0.127193 0.547456 -0.160543 -0.106144 0.381768 0.423133 0.228506 0.465646 0.495332 -0.122592 0.152933 0.149983 0.237555 0.165532 0.166690 0.198998 0.139830 0.116776 0.121236
qa: 0.8805 -0.1681 -0.1742 -0.1788 -0.1640 -0.1660 -0.1607 -0.4973 -0.4864 -0.4459 -0.2555 -0.2076 -0.1345 -0.3763 -0.4130 -0.3466 -0.1244 -0.0517 -0.0044 -0.1272 0.5475 -0.1605 -0.1061 0.3818 0.4231 0.2285 0.4656 0.4953 -0.1226 0.1529 0.1500 0.2376 0.1655 0.1667 0.1990 0.1398 0.1168 0.1212
va: 5.8175 1.1256 1.1297 1.1218 1.1447 1.1397 1.1527 1.9942 2.0172 2.0761 2.1737 3.1050 3.2293 3.0017 2.9758 3.0189 3.8491 3.7653 3.8272 3.9586 4.4107 3.9648 3.9003 4.4001 4.2019 4.0821 4.2225 4.5237 3.8436 1.0187 1.0084 1.0214 0.9877 0.9866 1.0128 0.9952 0.9978 0.9931
dispcorr: -0.020620848 hartree
energy: -2073.037661517067
dipole: 24.38255 -22.81867 1.56388 -2.09916 1.43041 -0.66875 6.12503 -7.61178 -1.48675
magnitude: 2.25906 au
magnitude: 5.74208 debye
