program: Orca
programVersion: 5.0.2
elementType: S F F F F F F O O O O N N N N N C C C C C C C C C C C C C H H H H H H H H H
charge: 0
multiplicity: 1
keywords: wb97x-d3
keywords: def2-TZVPP
keywords: def2/J RIJCOSX
keywords: DEFGRID2
keywords: scfconv7
keywords: smallprint printgap noloewdin
keywords: NOSOSCF
formula: C13H9F6N5O4S
InChI: InChI=1S/C13H9F6N5O4S/c1-28-11-21-8(13(17,18)19)20-9(23-11)22-10(25)24-29(26,27)7-5-3-2-4-6(7)12(14,15)16/h2-5,22,24H,1H3
38 atoms
S  2.330898 0.494313 -1.528546
F  2.893749 0.585803 3.033194
F  3.316512 2.038301 1.520511
F  1.50505 0.863663 1.43294
F  -6.362992 0.141509 0.498114
F  -5.833256 -1.697739 -0.486742
F  -5.365736 -1.417052 1.59886
O  2.663428 0.116595 -2.876874
O  2.343816 1.876922 -1.114942
O  0.965812 -2.194969 -1.760214
O  -2.445622 2.733689 0.224017
N  0.766211 0.00167 -1.193022
N  -1.056438 -1.444321 -1.091793
N  -3.19852 -1.102924 -0.395829
N  -1.686761 0.695917 -0.435423
N  -3.895223 1.044195 0.289343
C  3.361597 -0.48169 -0.437568
C  3.537361 -0.238521 0.932242
C  4.067638 -1.495557 -1.067251
C  4.44995 -1.022873 1.62409
C  2.811454 0.827226 1.72034
C  4.969807 -2.268888 -0.35567
C  5.165802 -2.025833 0.988407
C  0.301089 -1.266185 -1.38875
C  -1.999945 -0.580343 -0.628533
C  -4.07828 -0.234601 0.063034
C  -2.664509 1.465527 0.016801
C  -5.442944 -0.805365 0.415758
C  -1.150271 3.267929 -0.039968
H  3.91606 -1.679542 -2.11992
H  4.613761 -0.858015 2.678332
H  0.122614 0.713022 -0.840234
H  5.515132 -3.054111 -0.860333
H  5.87355 -2.61476 1.555221
H  -1.378329 -2.393688 -1.219713
H  -0.389202 2.809561 0.590771
H  -1.220894 4.325698 0.19243
H  -0.870548 3.145738 -1.086382
totalener: -2072.98841230 hartree
nucrepener: 3255.07906754 hartree
electener: -5328.06747984 hartree
oneelecener: -9330.51704979 hartree
twoeener: 4002.44956995 hartree
kineticenergy: 2066.23485095 hartree
xcener: -163.692811376876 hartree
chargesum: 0.0000000
charge: 0.862968 -0.170259 -0.147061 -0.184584 -0.144677 -0.152469 -0.160282 -0.428122 -0.451841 -0.361315 -0.221443 -0.220541 -0.164081 -0.348488 -0.426901 -0.278631 -0.169622 -0.074071 0.036846 -0.115931 0.543788 -0.137910 -0.093840 0.349002 0.404319 0.157610 0.432934 0.499337 -0.128810 0.141384 0.135052 0.204822 0.138726 0.138708 0.180427 0.107484 0.132577 0.114897
qa: 0.8630 -0.1703 -0.1471 -0.1846 -0.1447 -0.1525 -0.1603 -0.4281 -0.4518 -0.3613 -0.2214 -0.2205 -0.1641 -0.3485 -0.4269 -0.2786 -0.1696 -0.0741 0.0368 -0.1159 0.5438 -0.1379 -0.0938 0.3490 0.4043 0.1576 0.4329 0.4993 -0.1288 0.1414 0.1351 0.2048 0.1387 0.1387 0.1804 0.1075 0.1326 0.1149
va: 5.8388 1.1318 1.1551 1.1152 1.1734 1.1606 1.1463 2.0821 2.0440 2.1591 2.1961 3.1016 3.2031 3.0277 2.9718 3.0046 3.9454 3.8158 3.8588 3.9888 4.4205 3.9840 3.9384 4.4021 4.1805 4.1363 4.2316 4.5102 3.8671 1.0268 1.0159 1.0539 0.9982 0.9979 1.0278 1.0005 0.9976 0.9937
dispcorr: -0.020676120 hartree
energy: -2073.009088417063
dipole: 24.28302 -23.03559 1.24743 -0.06786 -0.45052 -0.51838 -8.05575 8.74761 0.69186
magnitude: 1.51772 au
magnitude: 3.85773 debye
