program: Orca
programVersion: 5.0.2
elementType: S F F F F F F O O O O N N N N N C C C C C C C C C C C C C H H H H H H H H H
charge: 0
multiplicity: 1
keywords: wb97x-d3
keywords: def2-TZVPP
keywords: def2/J RIJCOSX
keywords: DEFGRID2
keywords: scfconv7
keywords: smallprint printgap noloewdin
keywords: NOSOSCF
formula: C13H9F6N5O4S
InChI: InChI=1S/C13H9F6N5O4S/c1-28-11-21-8(13(17,18)19)20-9(23-11)22-10(25)24-29(26,27)7-5-3-2-4-6(7)12(14,15)16/h2-5,22,24H,1H3
38 atoms
S  2.229847 0.432508 -1.56666
F  3.151663 0.741256 2.920544
F  3.448529 2.134027 1.324376
F  1.648404 0.941907 1.416935
F  -5.68343 -1.222352 1.518073
F  -6.459476 0.223163 0.118237
F  -5.854391 -1.722715 -0.571324
O  2.449813 0.002903 -2.923571
O  2.243334 1.83294 -1.216238
O  0.900302 -2.289357 -1.609741
O  -2.438925 2.672083 0.417064
N  0.716692 -0.083231 -1.069564
N  -1.104341 -1.523094 -0.906186
N  -3.272998 -1.123743 -0.339274
N  -1.706015 0.624681 -0.244397
N  -3.946293 1.035133 0.33283
C  3.369759 -0.47307 -0.524249
C  3.64971 -0.164332 0.814687
C  4.035663 -1.510331 -1.159267
C  4.624381 -0.905917 1.468124
C  2.972319 0.928028 1.609024
C  5.000443 -2.241228 -0.48537
C  5.299785 -1.932288 0.82583
C  0.247394 -1.354623 -1.232753
C  -2.045879 -0.63626 -0.48426
C  -4.154816 -0.232261 0.064824
C  -2.685906 1.417886 0.161688
C  -5.569609 -0.74413 0.277535
C  -1.110334 3.166136 0.259126
H  3.802473 -1.747305 -2.186222
H  4.86761 -0.690297 2.497734
H  0.085176 0.628791 -0.695803
H  5.512385 -3.04671 -0.993013
H  6.056279 -2.488445 1.362208
H  -1.443134 -2.464815 -1.046777
H  -0.75706 3.056461 -0.766395
H  -0.414624 2.667776 0.933298
H  -1.162014 4.220883 0.50995
totalener: -2072.98823901 hartree
nucrepener: 3249.03794566 hartree
electener: -5322.02618467 hartree
oneelecener: -9318.42711924 hartree
twoeener: 3996.40093457 hartree
kineticenergy: 2066.23873351 hartree
xcener: -163.693446237735 hartree
chargesum: 0.0000000
charge: 0.862013 -0.170379 -0.146850 -0.184474 -0.160434 -0.145738 -0.151033 -0.428020 -0.451459 -0.361060 -0.221717 -0.223232 -0.164055 -0.347395 -0.425931 -0.280822 -0.160609 -0.075825 0.031517 -0.114326 0.542993 -0.135345 -0.096102 0.350181 0.404679 0.159885 0.431912 0.498369 -0.130632 0.140586 0.134867 0.204525 0.138593 0.138688 0.180687 0.113500 0.110142 0.132302
qa: 0.8620 -0.1704 -0.1468 -0.1845 -0.1604 -0.1457 -0.1510 -0.4280 -0.4515 -0.3611 -0.2217 -0.2232 -0.1641 -0.3474 -0.4259 -0.2808 -0.1606 -0.0758 0.0315 -0.1143 0.5430 -0.1353 -0.0961 0.3502 0.4047 0.1599 0.4319 0.4984 -0.1306 0.1406 0.1349 0.2045 0.1386 0.1387 0.1807 0.1135 0.1101 0.1323
va: 5.8358 1.1315 1.1555 1.1161 1.1463 1.1710 1.1623 2.0828 2.0431 2.1600 2.1960 3.1012 3.2016 3.0193 2.9747 3.0114 3.9380 3.8224 3.8631 3.9872 4.4206 3.9818 3.9406 4.4016 4.1821 4.1352 4.2321 4.5083 3.8669 1.0266 1.0158 1.0541 0.9982 0.9980 1.0276 0.9957 1.0006 0.9978
dispcorr: -0.020678704 hartree
energy: -2073.008917713755
dipole: 24.57508 -23.18665 1.38843 -0.86640 0.32498 -0.54143 -6.50641 7.34473 0.83832
magnitude: 1.70988 au
magnitude: 4.34616 debye
