program: Orca
programVersion: 5.0.2
elementType: S F F F F F F O O O O N N N N N C C C C C C C C C C C C C H H H H H H H H H
charge: 0
multiplicity: 1
keywords: wb97x-d3
keywords: def2-TZVPP
keywords: def2/J RIJCOSX
keywords: DEFGRID2
keywords: scfconv7
keywords: smallprint printgap noloewdin
keywords: NOSOSCF
formula: C13H9F6N5O4S
InChI: InChI=1S/C13H9F6N5O4S/c1-28-11-21-8(13(17,18)19)20-9(23-11)22-10(25)24-29(26,27)7-5-3-2-4-6(7)12(14,15)16/h2-5,22,24H,1H3
38 atoms
S  2.460788 -0.026396 1.691361
F  1.070536 0.109564 -1.766158
F  1.786174 1.806739 -0.64907
F  2.447051 1.492307 -2.657114
F  -5.694199 -1.640363 -0.02848
F  -6.223454 0.408945 -0.428226
F  -5.222624 -0.758601 -1.937009
O  2.503788 1.395184 1.937171
O  2.790972 -0.958595 2.738601
O  1.166074 -2.510234 0.652535
O  -2.374214 2.710269 0.988701
N  0.899778 -0.309645 1.168666
N  -0.880882 -1.597107 0.393506
N  -3.033011 -1.042016 -0.080445
N  -1.562842 0.603223 0.727134
N  -3.791465 1.168758 0.231251
C  3.46827 -0.458632 0.267931
C  3.304711 0.02037 -1.039622
C  4.522581 -1.307698 0.569178
C  4.219288 -0.377901 -2.006166
C  2.150142 0.866314 -1.516991
C  5.430976 -1.682198 -0.406947
C  5.279163 -1.214977 -1.696604
C  0.469796 -1.53732 0.74502
C  -1.844389 -0.639212 0.349673
C  -3.942279 -0.088569 -0.108531
C  -2.563221 1.466338 0.64575
C  -5.303701 -0.519625 -0.627784
C  -1.085136 3.120224 1.436789
H  4.629906 -1.691037 1.572805
H  4.112378 -0.03421 -3.02431
H  0.241009 0.471804 1.181756
H  6.245928 -2.345349 -0.152085
H  5.975855 -1.502364 -2.471948
H  -1.17933 -2.510528 0.080571
H  -1.176595 4.179886 1.653859
H  -0.32695 2.972399 0.668459
H  -0.786672 2.59186 2.342676
totalener: -2072.98631625 hartree
nucrepener: 3300.90323132 hartree
electener: -5373.88954756 hartree
oneelecener: -9422.07381736 hartree
twoeener: 4048.18426979 hartree
kineticenergy: 2066.23833434 hartree
xcener: -163.693378833376 hartree
chargesum: -0.0000000
charge: 0.855148 -0.169602 -0.166668 -0.164648 -0.154501 -0.144463 -0.159561 -0.442145 -0.430197 -0.341964 -0.221828 -0.239972 -0.155195 -0.349267 -0.424706 -0.277300 -0.128280 -0.060797 -0.009607 -0.130126 0.553176 -0.139263 -0.090721 0.324027 0.406517 0.157101 0.429976 0.500048 -0.132728 0.146086 0.133805 0.213346 0.138215 0.138315 0.180027 0.132902 0.110017 0.114834
qa: 0.8551 -0.1696 -0.1667 -0.1646 -0.1545 -0.1445 -0.1596 -0.4421 -0.4302 -0.3420 -0.2218 -0.2400 -0.1552 -0.3493 -0.4247 -0.2773 -0.1283 -0.0608 -0.0096 -0.1301 0.5532 -0.1393 -0.0907 0.3240 0.4065 0.1571 0.4300 0.5000 -0.1327 0.1461 0.1338 0.2133 0.1382 0.1383 0.1800 0.1329 0.1100 0.1148
va: 5.8433 1.1139 1.1458 1.1437 1.1572 1.1748 1.1486 2.0388 2.0747 2.1717 2.1933 3.0814 3.2072 3.0350 2.9716 3.0005 3.9597 3.7785 3.8962 4.0063 4.3942 3.9996 3.9449 4.4220 4.1724 4.1364 4.2357 4.5138 3.8657 1.0237 1.0167 1.0488 0.9985 0.9979 1.0280 0.9976 0.9999 0.9928
dispcorr: -0.021568593 hartree
energy: -2073.007884839536
dipole: 27.61851 -26.18348 1.43503 0.73161 -0.61237 0.11924 8.65461 -9.45538 -0.80077
magnitude: 1.64765 au
magnitude: 4.18799 debye
