program: Orca
programVersion: 4.2.1
elementType: S F F F O O O O N N N N N C C C C C C C C C C C C C C C H H H H H H H H H H H H H H H H
charge: 0
multiplicity: 1
keywords: wb97x-d3
keywords: def2-TZVPP
keywords: def2/J RIJCOSX GRIDX6 NOFINALGRIDX
keywords: grid4 nofinalgrid
keywords: scfconv7
keywords: smallprint printgap noloewdin
keywords: NOSOSCF
formula: C15H16F3N5O4S
InChI: InChI=1S/C15H16F3N5O4S/c1-9-19-12(22-14(20-9)27-2)21-13(24)23-28(25,26)11-6-4-3-5-10(11)7-8-15(16,17)18/h3-6,21,23H,7-8H2,1-2H3
44 atoms
S  1.119434 0.491186 1.490025
F  3.877477 -2.070185 0.324314
F  3.919014 -3.942603 -0.733825
F  2.191688 -3.403047 0.425008
O  1.144598 -0.929545 1.786914
O  1.207652 1.427954 2.594192
O  -0.009678 2.901323 0.215294
O  -6.421102 0.96649 -0.836798
N  -0.335887 0.70661 0.697611
N  -2.049922 2.019214 -0.169751
N  -2.822099 -0.111552 0.354349
N  -4.240638 1.541273 -0.533559
N  -5.088246 -0.59398 0.005843
C  2.524562 0.184375 -0.892123
C  1.707453 -1.006836 -1.332177
C  2.345711 0.917053 0.285455
C  2.534287 -2.260624 -1.619674
C  3.524561 0.630916 -1.754586
C  3.13194 2.024252 0.592171
C  3.125431 -2.911025 -0.401492
C  4.318441 1.724825 -1.459569
C  4.127768 2.424021 -0.277518
C  -0.740294 1.935473 0.258023
C  -3.063604 1.103724 -0.107805
C  -3.875773 -0.931312 0.396622
C  -5.208056 0.651561 -0.450787
C  -3.648055 -2.292471 0.941489
C  -6.671327 2.273823 -1.355666
H  0.905562 -1.252199 -0.643689
H  1.216678 -0.735852 -2.268474
H  1.897488 -2.996477 -2.113047
H  3.346293 -2.041189 -2.314261
H  3.682614 0.109302 -2.690002
H  2.972931 2.580648 1.503394
H  5.083993 2.034047 -2.157936
H  4.739864 3.281508 -0.036406
H  -1.047943 -0.037738 0.757515
H  -2.309378 2.929912 -0.526896
H  -4.502843 -2.939182 0.767318
H  -2.758234 -2.73971 0.501191
H  -3.476262 -2.227518 2.017391
H  -6.091163 2.461501 -2.257594
H  -6.457321 3.044017 -0.61671
H  -7.729318 2.292377 -1.598595
elementType: S F O N C H
totalener: -1853.88229465 hartree
nucrepener: 3007.10525895 hartree
electener: -4860.98755360 hartree
oneelecener: -8527.09247888 hartree
twoeener: 3666.10492528 hartree
cpcmener: -0.05463890 hartree
kineticenergy: 1847.41134648 hartree
xcener: -150.169879507343 hartree
chargesum: -0.0000000
charge: 0.888450 -0.188965 -0.191601 -0.189178 -0.513681 -0.518161 -0.474034 -0.279850 -0.222583 -0.130313 -0.420761 -0.413871 -0.368826 0.019020 -0.083489 -0.105958 -0.167251 -0.180182 -0.032046 0.503289 -0.117786 -0.184675 0.388431 0.402309 0.326994 0.467467 -0.251008 -0.115328 0.071981 0.128048 0.121679 0.104632 0.138360 0.151806 0.166559 0.166827 0.210656 0.197000 0.098670 0.107768 0.118100 0.119004 0.118771 0.133725
qa: 0.8885 -0.1890 -0.1916 -0.1892 -0.5137 -0.5182 -0.4740 -0.2798 -0.2226 -0.1303 -0.4208 -0.4139 -0.3688 0.0190 -0.0835 -0.1060 -0.1673 -0.1802 -0.0320 0.5033 -0.1178 -0.1847 0.3884 0.4023 0.3270 0.4675 -0.2510 -0.1153 0.0720 0.1280 0.1217 0.1046 0.1384 0.1518 0.1666 0.1668 0.2107 0.1970 0.0987 0.1078 0.1181 0.1190 0.1188 0.1337
va: 5.7837 1.0962 1.1055 1.1028 1.9623 1.9804 2.0434 2.1250 3.0752 3.2103 3.0051 2.9580 3.0131 3.6484 3.7798 3.7106 3.9212 3.9672 3.8283 4.3833 3.8971 3.9409 4.3921 4.2065 3.9267 4.2302 3.9334 3.8426 1.0516 1.0016 1.0203 1.0226 1.0027 1.0168 0.9862 0.9878 1.0643 1.0136 1.0183 1.0033 0.9987 0.9947 0.9947 0.9941
dispcorr: -0.023351070 hartree
energy: -1853.905645716364
dipole: -19.18048 17.57423 -1.60625 11.91274 -11.22059 0.69215 -11.40021 7.69992 -3.70029
magnitude: 4.09283 au
magnitude: 10.40314 debye
