program: Orca
programVersion: 4.2.1
elementType: S F F F O O O O N N N N N C C C C C C C C C C C C C C C H H H H H H H H H H H H H H H H
charge: 0
multiplicity: 1
keywords: wb97x-d3
keywords: def2-TZVPP
keywords: def2/J RIJCOSX GRIDX6 NOFINALGRIDX
keywords: grid4 nofinalgrid
keywords: scfconv7
keywords: smallprint printgap noloewdin
keywords: NOSOSCF
formula: C15H16F3N5O4S
InChI: InChI=1S/C15H16F3N5O4S/c1-9-19-12(22-14(20-9)27-2)21-13(24)23-28(25,26)11-6-4-3-5-10(11)7-8-15(16,17)18/h3-6,21,23H,7-8H2,1-2H3
44 atoms
S  1.083217 1.544854 1.637894
F  0.389096 -3.07497 -1.201866
F  1.720371 -3.777783 0.331734
F  2.121054 -4.235375 -1.732337
O  1.093164 0.356955 2.471938
O  1.020496 2.841041 2.280129
O  -0.065693 3.277472 -0.478484
O  -3.18832 -1.952181 1.101508
N  -0.269147 1.334255 0.678745
N  -1.95708 2.073613 -0.739965
N  -4.041568 1.22552 -1.095151
N  -2.507211 0.036351 0.230782
N  -4.6648 -0.824129 -0.121188
C  2.786928 0.378679 -0.225699
C  2.020436 -0.91582 -0.110786
C  2.438125 1.532275 0.496968
C  2.503154 -2.016252 -1.046497
C  3.887326 0.492211 -1.069053
C  3.143804 2.722689 0.381423
C  1.68707 -3.270846 -0.910804
C  4.6047 1.674448 -1.188329
C  4.237053 2.794283 -0.464542
C  -0.709948 2.293287 -0.189528
C  -2.86131 1.071029 -0.519929
C  -4.915199 0.25063 -0.857391
C  -3.445648 -0.881843 0.388377
C  -6.256585 0.364494 -1.482969
C  -1.886327 -2.11959 1.662464
H  2.080674 -1.266853 0.919149
H  0.966228 -0.715756 -0.315624
H  2.449062 -1.698487 -2.089388
H  3.541867 -2.2782 -0.837121
H  4.207557 -0.357003 -1.654922
H  2.849848 3.595741 0.94484
H  5.454913 1.71259 -1.855723
H  4.788634 3.719283 -0.555223
H  -0.886093 0.532922 0.866302
H  -2.276499 2.812937 -1.353314
H  -6.221764 -0.070224 -2.484586
H  -7.00598 -0.178497 -0.912854
H  -6.55662 1.40433 -1.588068
H  -1.917998 -3.059919 2.203945
H  -1.640346 -1.318011 2.358338
H  -1.126788 -2.186728 0.883946
elementType: S F O N C H
totalener: -1853.88357926 hartree
nucrepener: 3040.60415830 hartree
electener: -4894.48773756 hartree
oneelecener: -8592.33303251 hartree
twoeener: 3697.84529496 hartree
cpcmener: -0.04811248 hartree
kineticenergy: 1847.38858241 hartree
xcener: -150.169234268202 hartree
chargesum: -0.0000000
charge: 0.889818 -0.194181 -0.193582 -0.185306 -0.518510 -0.507337 -0.470284 -0.277201 -0.223156 -0.130662 -0.405128 -0.425692 -0.370113 0.056654 -0.093002 -0.159473 -0.166198 -0.192899 -0.023217 0.512910 -0.110973 -0.186742 0.393126 0.402702 0.327053 0.459703 -0.239997 -0.114612 0.132386 0.086601 0.112404 0.112113 0.139024 0.150391 0.166848 0.166796 0.211031 0.196287 0.118438 0.100360 0.101367 0.144010 0.122858 0.085381
qa: 0.8898 -0.1942 -0.1936 -0.1853 -0.5185 -0.5073 -0.4703 -0.2772 -0.2232 -0.1307 -0.4051 -0.4257 -0.3701 0.0567 -0.0930 -0.1595 -0.1662 -0.1929 -0.0232 0.5129 -0.1110 -0.1867 0.3931 0.4027 0.3271 0.4597 -0.2400 -0.1146 0.1324 0.0866 0.1124 0.1121 0.1390 0.1504 0.1668 0.1668 0.2110 0.1963 0.1184 0.1004 0.1014 0.1440 0.1229 0.0854
va: 5.7781 1.0968 1.0989 1.1165 1.9588 1.9900 2.0476 2.1375 3.0905 3.2147 3.0176 2.9482 3.0027 3.7094 3.7875 3.8397 3.9411 3.9235 3.8296 4.4056 3.9173 3.9486 4.3887 4.2189 3.9582 4.2216 3.9322 3.8566 1.0097 1.0234 1.0169 1.0173 1.0068 1.0183 0.9867 0.9879 1.0581 1.0157 0.9986 1.0129 1.0114 0.9992 0.9947 1.0008
dispcorr: -0.024443944 hartree
energy: -1853.908023206778
dipole: -5.08483 5.65443 0.56960 10.39025 -11.01507 -0.62482 -2.90541 0.64984 -2.25557
magnitude: 2.40883 au
magnitude: 6.12276 debye
