program: Orca
programVersion: 4.2.1
elementType: S F F F O O O O N N N N N C C C C C C C C C C C C C C C H H H H H H H H H H H H H H H H
charge: 0
multiplicity: 1
keywords: wb97x-d3
keywords: def2-TZVPP
keywords: def2/J RIJCOSX GRIDX6 NOFINALGRIDX
keywords: grid4 nofinalgrid
keywords: scfconv7
keywords: smallprint printgap noloewdin
keywords: NOSOSCF
formula: C15H16F3N5O4S
InChI: InChI=1S/C15H16F3N5O4S/c1-9-19-12(22-14(20-9)27-2)21-13(24)23-28(25,26)11-6-4-3-5-10(11)7-8-15(16,17)18/h3-6,21,23H,7-8H2,1-2H3
44 atoms
S  1.059377 1.679711 -1.564355
F  0.367107 -3.108176 1.130659
F  2.114566 -4.349002 1.3245
F  1.491693 -3.658933 -0.615852
O  0.987769 3.024899 -2.098032
O  1.060501 0.565805 -2.495606
O  -0.027392 3.20927 0.725626
O  -3.163134 -1.913997 -1.153861
N  -0.279094 1.390613 -0.610085
N  -1.897439 1.966013 0.958289
N  -3.960189 1.069206 1.318669
N  -2.467283 0.008278 -0.154961
N  -4.602575 -0.902903 0.207001
C  2.756847 0.381417 0.217038
C  1.929045 -0.872775 0.084122
C  2.431652 1.575687 -0.448973
C  2.477782 -2.072887 0.844361
C  3.881077 0.420934 1.035039
C  3.179779 2.735909 -0.299906
C  1.616679 -3.292021 0.66978
C  4.641515 1.572358 1.185649
C  4.294637 2.734526 0.520931
C  -0.680127 2.251855 0.373212
C  -2.801283 0.974825 0.690281
C  -4.834594 0.107078 1.034952
C  -3.402729 -0.905451 -0.349911
C  -6.153679 0.159432 1.713825
C  -1.881966 -2.022439 -1.773337
H  0.92027 -0.654944 0.443847
H  1.841723 -1.12841 -0.97135
H  3.481908 -2.323435 0.498326
H  2.540681 -1.868168 1.914461
H  4.185599 -0.462699 1.577107
H  2.902287 3.641418 -0.818799
H  5.509084 1.552807 1.831118
H  4.879578 3.635811 0.637551
H  -0.888014 0.592157 -0.832876
H  -2.19488 2.641608 1.651301
H  -6.478176 1.186641 1.864048
H  -6.908993 -0.385905 1.154201
H  -6.068755 -0.303594 2.699636
H  -1.671534 -1.169498 -2.418235
H  -1.923592 -2.921737 -2.379967
H  -1.092215 -2.134292 -1.030917
elementType: S F O N C H
totalener: -1853.88339970 hartree
nucrepener: 3049.81246446 hartree
electener: -4903.69586416 hartree
oneelecener: -8610.70498280 hartree
twoeener: 3707.00911864 hartree
cpcmener: -0.04842403 hartree
kineticenergy: 1847.38351539 hartree
xcener: -150.168715401446 hartree
chargesum: 0.0000000
charge: 0.887453 -0.194592 -0.185047 -0.193819 -0.508220 -0.519742 -0.469073 -0.276903 -0.223873 -0.130657 -0.405483 -0.426067 -0.369453 0.063998 -0.108735 -0.160580 -0.166512 -0.192996 -0.028144 0.514755 -0.112045 -0.184725 0.394125 0.402100 0.326940 0.460295 -0.239154 -0.111569 0.094441 0.135905 0.115159 0.109067 0.138716 0.151829 0.166872 0.167130 0.213483 0.196500 0.102207 0.099364 0.118014 0.123588 0.143960 0.081490
qa: 0.8875 -0.1946 -0.1850 -0.1938 -0.5082 -0.5197 -0.4691 -0.2769 -0.2239 -0.1307 -0.4055 -0.4261 -0.3695 0.0640 -0.1087 -0.1606 -0.1665 -0.1930 -0.0281 0.5148 -0.1120 -0.1847 0.3941 0.4021 0.3269 0.4603 -0.2392 -0.1116 0.0944 0.1359 0.1152 0.1091 0.1387 0.1518 0.1669 0.1671 0.2135 0.1965 0.1022 0.0994 0.1180 0.1236 0.1440 0.0815
va: 5.7802 1.0969 1.1172 1.0991 1.9882 1.9555 2.0480 2.1377 3.0852 3.2148 3.0178 2.9477 3.0043 3.6976 3.7847 3.8438 3.9501 3.9270 3.8341 4.4045 3.9194 3.9482 4.3861 4.2195 3.9580 4.2199 3.9327 3.8576 1.0165 1.0115 1.0171 1.0172 1.0071 1.0174 0.9868 0.9877 1.0569 1.0155 1.0103 1.0140 0.9987 0.9947 0.9993 1.0010
dispcorr: -0.024722726 hartree
energy: -1853.908122424504
dipole: -4.55342 5.18104 0.62762 9.80063 -10.63227 -0.83163 3.72387 -1.51140 2.21247
magnitude: 2.44552 au
magnitude: 6.21601 debye
