program: Orca
programVersion: 4.2.1
elementType: S F F F O O O O N N N N N C C C C C C C C C C C C C C C H H H H H H H H H H H H H H H H
charge: 0
multiplicity: 1
keywords: wb97x-d3
keywords: def2-TZVPP
keywords: def2/J RIJCOSX GRIDX6 NOFINALGRIDX
keywords: grid4 nofinalgrid
keywords: scfconv7
keywords: smallprint printgap noloewdin
keywords: NOSOSCF
formula: C15H16F3N5O4S
InChI: InChI=1S/C15H16F3N5O4S/c1-9-19-12(22-14(20-9)27-2)21-13(24)23-28(25,26)11-6-4-3-5-10(11)7-8-15(16,17)18/h3-6,21,23H,7-8H2,1-2H3
44 atoms
S  1.126239 1.412981 1.589875
F  2.287374 -2.511569 -1.859917
F  1.149916 -0.687478 -1.77401
F  0.136413 -2.581721 -1.766679
O  1.040166 0.422659 2.648517
O  1.06803 2.816962 1.943871
O  0.220715 2.556366 -1.020212
O  -3.459256 -1.639491 1.88049
N  -0.184368 1.039528 0.621985
N  -1.704633 1.382824 -1.102821
N  -3.811351 0.562958 -1.386474
N  -2.515206 -0.155865 0.437224
N  -4.702382 -0.96926 0.162049
C  3.08284 -0.124513 0.311941
C  2.565319 -1.448544 0.821097
C  2.551761 1.148067 0.571336
C  1.268289 -1.981705 0.208372
C  4.225896 -0.164899 -0.48428
C  3.13923 2.304392 0.065607
C  1.214961 -1.94092 -1.2926
C  4.816767 0.978408 -0.996398
C  4.272723 2.221268 -0.721569
C  -0.49701 1.718862 -0.52105
C  -2.707838 0.563958 -0.661376
C  -4.785684 -0.221191 -0.929011
C  -3.546136 -0.898409 0.802806
C  -6.059821 -0.229395 -1.690316
C  -2.245716 -1.634508 2.632886
H  3.349742 -2.184827 0.650312
H  2.423143 -1.418743 1.898929
H  1.152591 -3.019951 0.522269
H  0.397382 -1.451792 0.586992
H  4.673008 -1.126895 -0.697607
H  2.722123 3.275786 0.282919
H  5.705696 0.893439 -1.606574
H  4.724217 3.123768 -1.10873
H  -0.88884 0.38986 0.996652
H  -1.913567 1.900266 -1.947273
H  -6.565427 0.729182 -1.558672
H  -5.87184 -0.346975 -2.756573
H  -6.724166 -1.018197 -1.349883
H  -2.008034 -0.63824 3.004561
H  -1.414731 -2.027475 2.047102
H  -2.421091 -2.293922 3.477187
elementType: S F O N C H
totalener: -1853.87921476 hartree
nucrepener: 3157.00267675 hartree
electener: -5010.88189151 hartree
oneelecener: -8825.93127082 hartree
twoeener: 3815.04937931 hartree
cpcmener: -0.04575468 hartree
kineticenergy: 1847.40595019 hartree
xcener: -150.170679955282 hartree
chargesum: 0.0000000
charge: 0.892640 -0.186785 -0.187311 -0.188950 -0.521871 -0.510460 -0.465933 -0.274486 -0.204327 -0.120167 -0.407995 -0.429291 -0.366269 -0.012339 -0.133041 -0.099517 -0.141016 -0.134255 -0.015541 0.525131 -0.113360 -0.190164 0.357461 0.395001 0.330625 0.465600 -0.237503 -0.137709 0.110384 0.128267 0.136261 0.014269 0.137428 0.142657 0.166812 0.167417 0.205135 0.196599 0.113540 0.107793 0.096180 0.121808 0.126253 0.141029
qa: 0.8926 -0.1868 -0.1873 -0.1889 -0.5219 -0.5105 -0.4659 -0.2745 -0.2043 -0.1202 -0.4080 -0.4293 -0.3663 -0.0123 -0.1330 -0.0995 -0.1410 -0.1343 -0.0155 0.5251 -0.1134 -0.1902 0.3575 0.3950 0.3306 0.4656 -0.2375 -0.1377 0.1104 0.1283 0.1363 0.0143 0.1374 0.1427 0.1668 0.1674 0.2051 0.1966 0.1135 0.1078 0.0962 0.1218 0.1263 0.1410
va: 5.7678 1.1135 1.0875 1.1086 1.9567 1.9875 2.0510 2.1380 3.0846 3.2002 3.0193 2.9365 3.0082 3.6176 3.8070 3.7011 3.9009 3.9339 3.8201 4.3461 3.9104 3.9482 4.3978 4.2230 3.9540 4.2125 3.9306 3.8534 1.0069 1.0124 1.0240 1.0519 1.0055 1.0243 0.9856 0.9877 1.0591 1.0156 1.0009 1.0055 1.0173 0.9932 0.9834 0.9988
dispcorr: -0.027332269 hartree
energy: -1853.906547027608
dipole: -5.63161 5.76577 0.13415 -0.27522 -1.56959 -1.84481 7.38965 -7.89229 -0.50264
magnitude: 1.91676 au
magnitude: 4.87202 debye
