program: Orca
programVersion: 4.2.1
elementType: S F F F O O O O N N N N N C C C C C C C C C C C C C C C H H H H H H H H H H H H H H H H
charge: 0
multiplicity: 1
keywords: wb97x-d3
keywords: def2-TZVPP
keywords: def2/J RIJCOSX GRIDX6 NOFINALGRIDX
keywords: grid4 nofinalgrid
keywords: scfconv7
keywords: smallprint printgap noloewdin
keywords: NOSOSCF
formula: C15H16F3N5O4S
InChI: InChI=1S/C15H16F3N5O4S/c1-9-19-12(22-14(20-9)27-2)21-13(24)23-28(25,26)11-6-4-3-5-10(11)7-8-15(16,17)18/h3-6,21,23H,7-8H2,1-2H3
44 atoms
S  1.285052 1.537234 -1.661679
F  -0.445993 -1.669053 0.972735
F  0.943837 -0.401637 2.014406
F  0.552637 -2.392352 2.734702
O  1.28079 2.943261 -2.012355
O  1.284492 0.556294 -2.73349
O  0.226788 2.73419 0.819931
O  -3.107264 -1.849766 -1.892264
N  -0.096595 1.17659 -0.797919
N  -1.644013 1.476507 0.913645
N  -3.464531 0.22137 1.457588
N  -2.361643 -0.145308 -0.584777
N  -4.198518 -1.483879 0.012158
C  2.929582 -0.051302 -0.071921
C  2.19622 -1.325908 -0.425329
C  2.612075 1.233968 -0.527488
C  1.84609 -2.209773 0.771728
C  4.04768 -0.153542 0.75471
C  3.348801 2.354533 -0.151934
C  0.733192 -1.668733 1.622345
C  4.792859 0.950354 1.130008
C  4.440564 2.214074 0.682445
C  -0.450826 1.855617 0.333971
C  -2.51445 0.476694 0.576635
C  -4.292035 -0.766813 1.122976
C  -3.210854 -1.134038 -0.798152
C  -5.365662 -1.104425 2.090794
C  -2.030671 -1.5848 -2.793048
H  1.302705 -1.153103 -1.01774
H  2.852428 -1.912393 -1.071242
H  1.536481 -3.190368 0.406878
H  2.713303 -2.380967 1.408988
H  4.352807 -1.127672 1.113786
H  3.078856 3.337068 -0.50869
H  5.651357 0.820226 1.77484
H  5.010057 3.08472 0.975481
H  -0.759372 0.493065 -1.184209
H  -1.845655 1.946884 1.787127
H  -6.09897 -1.777938 1.657037
H  -4.926052 -1.59018 2.964306
H  -5.862981 -0.202524 2.444122
H  -2.155623 -2.284805 -3.613357
H  -1.066092 -1.768461 -2.318224
H  -2.071615 -0.568142 -3.181653
elementType: S F O N C H
totalener: -1853.88215491 hartree
nucrepener: 3198.95244330 hartree
electener: -5052.83459821 hartree
oneelecener: -8910.18858169 hartree
twoeener: 3857.35398349 hartree
cpcmener: -0.04995960 hartree
kineticenergy: 1847.40862648 hartree
xcener: -150.171444346960 hartree
chargesum: 0.0000000
charge: 0.892385 -0.191480 -0.190784 -0.184111 -0.512793 -0.521777 -0.465800 -0.275184 -0.205537 -0.117589 -0.401591 -0.421635 -0.365367 0.011165 -0.033801 -0.119051 -0.152933 -0.189115 -0.023318 0.500664 -0.109514 -0.189061 0.350317 0.369764 0.329056 0.458390 -0.240137 -0.124120 0.032499 0.127860 0.124448 0.105713 0.142850 0.150240 0.166679 0.167288 0.213650 0.198273 0.096500 0.114086 0.107314 0.140647 0.111168 0.123745
qa: 0.8924 -0.1915 -0.1908 -0.1841 -0.5128 -0.5218 -0.4658 -0.2752 -0.2055 -0.1176 -0.4016 -0.4216 -0.3654 0.0112 -0.0338 -0.1191 -0.1529 -0.1891 -0.0233 0.5007 -0.1095 -0.1891 0.3503 0.3698 0.3291 0.4584 -0.2401 -0.1241 0.0325 0.1279 0.1244 0.1057 0.1428 0.1502 0.1667 0.1673 0.2137 0.1983 0.0965 0.1141 0.1073 0.1406 0.1112 0.1237
va: 5.7772 1.0965 1.0927 1.1206 1.9865 1.9520 2.0473 2.1333 3.0690 3.2000 3.0047 2.9298 3.0095 3.6940 3.7940 3.7299 3.9114 3.9588 3.8333 4.3502 3.8899 3.9454 4.4089 4.2320 3.9551 4.2212 3.9330 3.8530 1.0547 1.0036 1.0196 1.0236 1.0018 1.0183 0.9863 0.9878 1.0576 1.0142 1.0171 1.0004 1.0061 0.9980 0.9886 0.9884
dispcorr: -0.027653720 hartree
energy: -1853.909808631386
dipole: 0.46337 0.33694 0.80031 -4.56054 2.08613 -2.47441 -4.67305 5.81350 1.14045
magnitude: 2.83969 au
magnitude: 7.21791 debye
