program: Orca
programVersion: 4.2.1
elementType: S F F F O O O O N N N N N C C C C C C C C C C C C C C C H H H H H H H H H H H H H H H H
charge: 0
multiplicity: 1
keywords: wb97x-d3
keywords: def2-TZVPP
keywords: def2/J RIJCOSX GRIDX6 NOFINALGRIDX
keywords: grid4 nofinalgrid
keywords: scfconv7
keywords: smallprint printgap noloewdin
keywords: NOSOSCF
formula: C15H16F3N5O4S
InChI: InChI=1S/C15H16F3N5O4S/c1-9-19-12(22-14(20-9)27-2)21-13(24)23-28(25,26)11-6-4-3-5-10(11)7-8-15(16,17)18/h3-6,21,23H,7-8H2,1-2H3
44 atoms
S  1.18011 1.8183 -1.332137
F  1.139618 -0.78119 1.888479
F  0.776444 -2.877734 2.216066
F  -0.318742 -1.82025 0.697224
O  1.117551 3.265486 -1.372666
O  1.126636 1.086959 -2.58679
O  0.259201 2.431661 1.406803
O  -3.211276 -1.470491 -2.084648
N  -0.127465 1.231644 -0.479744
N  -1.616896 1.181244 1.306837
N  -3.516236 -0.043737 1.591527
N  -2.39165 -0.09656 -0.470371
N  -4.327447 -1.390439 -0.160095
C  2.972859 -0.007574 -0.237182
C  2.227217 -1.207594 -0.775012
C  2.596873 1.332357 -0.386851
C  1.954894 -2.300139 0.2595
C  4.164392 -0.242368 0.447031
C  3.349788 2.374884 0.146806
C  0.89595 -1.944099 1.262523
C  4.928355 0.784468 0.972835
C  4.517218 2.100941 0.8325
C  -0.438885 1.668164 0.77759
C  -2.533717 0.312361 0.783046
C  -4.397758 -0.892405 1.066863
C  -3.29939 -0.964988 -0.877584
C  -5.517028 -1.331581 1.937248
C  -2.091804 -1.118685 -2.899161
H  1.300644 -0.94444 -1.275534
H  2.84806 -1.657225 -1.552247
H  1.626961 -3.201642 -0.259973
H  2.861219 -2.571203 0.800346
H  4.512618 -1.260195 0.565832
H  3.034171 3.400595 0.028796
H  5.847766 0.553261 1.493237
H  5.100869 2.910966 1.246329
H  -0.80332 0.626566 -0.96396
H  -1.798929 1.480324 2.256504
H  -5.148826 -2.073988 2.648558
H  -5.909496 -0.498367 2.516817
H  -6.317875 -1.784135 1.359597
H  -1.156418 -1.444058 -2.442581
H  -2.060973 -0.048691 -3.100888
H  -2.229256 -1.652423 -3.834245
elementType: S F O N C H
totalener: -1853.88249831 hartree
nucrepener: 3189.90507948 hartree
electener: -5043.78757779 hartree
oneelecener: -8892.11087073 hartree
twoeener: 3848.32329294 hartree
cpcmener: -0.04992071 hartree
kineticenergy: 1847.41320411 hartree
xcener: -150.172363924361 hartree
chargesum: 0.0000000
charge: 0.892993 -0.190451 -0.184931 -0.191895 -0.512687 -0.522759 -0.463131 -0.275920 -0.204881 -0.112169 -0.402546 -0.419997 -0.364994 0.005141 -0.039189 -0.106352 -0.153689 -0.188044 -0.029051 0.500318 -0.114630 -0.186515 0.342026 0.378969 0.328999 0.454129 -0.242082 -0.125401 0.033996 0.129888 0.125223 0.105383 0.142353 0.151237 0.167305 0.167642 0.213152 0.197877 0.115961 0.106420 0.097004 0.113043 0.122097 0.140158
qa: 0.8930 -0.1905 -0.1849 -0.1919 -0.5127 -0.5228 -0.4631 -0.2759 -0.2049 -0.1122 -0.4025 -0.4200 -0.3650 0.0051 -0.0392 -0.1064 -0.1537 -0.1880 -0.0291 0.5003 -0.1146 -0.1865 0.3420 0.3790 0.3290 0.4541 -0.2421 -0.1254 0.0340 0.1299 0.1252 0.1054 0.1424 0.1512 0.1673 0.1676 0.2132 0.1979 0.1160 0.1064 0.0970 0.1130 0.1221 0.1402
va: 5.7776 1.0939 1.1191 1.0967 1.9874 1.9500 2.0509 2.1341 3.0679 3.2004 3.0129 2.9299 3.0077 3.6895 3.7894 3.7214 3.9070 3.9614 3.8368 4.3569 3.8955 3.9433 4.4155 4.2251 3.9543 4.2268 3.9342 3.8531 1.0579 1.0032 1.0190 1.0237 1.0018 1.0180 0.9861 0.9878 1.0594 1.0145 0.9992 1.0075 1.0163 0.9909 0.9896 0.9987
dispcorr: -0.027470447 hartree
energy: -1853.909968760776
dipole: -0.07172 0.99231 0.92059 -3.31694 0.66506 -2.65188 -6.08225 6.61315 0.53090
magnitude: 2.85689 au
magnitude: 7.26164 debye
