program: Orca
programVersion: 4.2.1
elementType: S F F F O O O O N N N N N C C C C C C C C C C C C C C C H H H H H H H H H H H H H H H H
charge: 0
multiplicity: 1
keywords: wb97x-d3
keywords: def2-TZVPP
keywords: def2/J RIJCOSX GRIDX6 NOFINALGRIDX
keywords: grid4 nofinalgrid
keywords: scfconv7
keywords: smallprint printgap noloewdin
keywords: NOSOSCF
formula: C15H16F3N5O4S
InChI: InChI=1S/C15H16F3N5O4S/c1-9-19-12(22-14(20-9)27-2)21-13(24)23-28(25,26)11-6-4-3-5-10(11)7-8-15(16,17)18/h3-6,21,23H,7-8H2,1-2H3
44 atoms
S  0.586171 -0.42926 1.15985
F  5.862485 -2.669138 1.04242
F  5.26439 -0.653819 0.596554
F  5.731651 -2.012889 -1.003087
O  0.787877 -1.863095 1.15788
O  0.539931 0.26579 2.433922
O  -0.479064 -1.079407 -1.511772
O  -6.819578 1.294426 -1.092628
N  -0.897092 -0.075796 0.478799
N  -2.521002 -0.18077 -1.182003
N  -3.338366 0.894984 0.712366
N  -4.673698 0.544935 -1.19164
N  -5.563919 1.629247 0.706154
C  2.642436 -0.23105 -0.759176
C  2.835413 -1.717669 -0.912381
C  1.736385 0.406445 0.09552
C  3.699203 -2.382512 0.162462
C  3.448605 0.602456 -1.537163
C  1.653144 1.796904 0.174574
C  5.130909 -1.927712 0.195402
C  3.37073 1.981094 -1.47341
C  2.469392 2.586297 -0.610055
C  -1.239128 -0.488118 -0.774092
C  -3.538151 0.443912 -0.515052
C  -4.389907 1.483352 1.287677
C  -5.64437 1.141286 -0.529953
C  -4.215472 1.971134 2.678527
C  -7.021553 0.811859 -2.42109
H  1.880209 -2.233474 -0.92905
H  3.280555 -1.896747 -1.891401
H  3.278615 -2.233061 1.156464
H  3.700302 -3.458714 -0.019561
H  4.156101 0.14637 -2.217717
H  0.945029 2.274156 0.8386
H  4.016165 2.583772 -2.09782
H  2.397219 3.66293 -0.548319
H  -1.602831 0.424071 1.039603
H  -2.743143 -0.493458 -2.118483
H  -4.995334 2.675849 2.952494
H  -4.26646 1.123363 3.365222
H  -3.239713 2.434816 2.810753
H  -6.863872 -0.263714 -2.483807
H  -6.369053 1.317282 -3.131528
H  -8.056387 1.038188 -2.659615
elementType: S F O N C H
totalener: -1853.88219762 hartree
nucrepener: 2949.12103651 hartree
electener: -4803.00323414 hartree
oneelecener: -8410.84311554 hartree
twoeener: 3607.83988140 hartree
cpcmener: -0.04546640 hartree
kineticenergy: 1847.40292573 hartree
xcener: -150.167957683228 hartree
chargesum: -0.0000000
charge: 0.891371 -0.190922 -0.187831 -0.193134 -0.507410 -0.529874 -0.483774 -0.280543 -0.202056 -0.127301 -0.419338 -0.415389 -0.370094 0.098509 -0.104770 -0.138456 -0.175047 -0.181600 -0.063004 0.509096 -0.096149 -0.200227 0.393561 0.406261 0.324036 0.465649 -0.252358 -0.115003 0.105190 0.111362 0.101294 0.117526 0.138006 0.132092 0.166349 0.165517 0.214578 0.196949 0.100519 0.120114 0.105691 0.118013 0.119090 0.133503
qa: 0.8914 -0.1909 -0.1878 -0.1931 -0.5074 -0.5299 -0.4838 -0.2805 -0.2021 -0.1273 -0.4193 -0.4154 -0.3701 0.0985 -0.1048 -0.1385 -0.1750 -0.1816 -0.0630 0.5091 -0.0961 -0.2002 0.3936 0.4063 0.3240 0.4656 -0.2524 -0.1150 0.1052 0.1114 0.1013 0.1175 0.1380 0.1321 0.1663 0.1655 0.2146 0.1969 0.1005 0.1201 0.1057 0.1180 0.1191 0.1335
va: 5.7822 1.1061 1.0968 1.1000 1.9798 1.9555 2.0303 2.1239 3.0941 3.2139 3.0102 2.9577 3.0105 3.4646 3.7758 3.6932 3.8731 3.9450 3.9131 4.3855 3.8960 3.9611 4.3707 4.1960 3.9281 4.2326 3.9345 3.8429 1.0359 1.0084 1.0388 1.0198 1.0071 1.0162 0.9852 0.9888 1.0640 1.0137 1.0163 0.9978 1.0056 0.9949 0.9947 0.9941
dispcorr: -0.023288325 hartree
energy: -1853.905485947368
dipole: -29.46969 27.22497 -2.24472 11.99160 -10.42907 1.56254 -5.97577 3.86655 -2.10921
magnitude: 3.45385 au
magnitude: 8.77899 debye
