program: Orca
programVersion: 4.2.1
elementType: S F F F O O O O N N N N N C C C C C C C C C C C C C C C H H H H H H H H H H H H H H H H
charge: 0
multiplicity: 1
keywords: wb97x-d3
keywords: def2-TZVPP
keywords: def2/J RIJCOSX GRIDX6 NOFINALGRIDX
keywords: grid4 nofinalgrid
keywords: scfconv7
keywords: smallprint printgap noloewdin
keywords: NOSOSCF
formula: C15H16F3N5O4S
InChI: InChI=1S/C15H16F3N5O4S/c1-9-19-12(22-14(20-9)27-2)21-13(24)23-28(25,26)11-6-4-3-5-10(11)7-8-15(16,17)18/h3-6,21,23H,7-8H2,1-2H3
44 atoms
S  0.294983 -0.96357 0.604711
F  5.491909 -3.244137 -0.067195
F  4.981807 -1.222516 0.454932
F  5.627021 -1.683765 -1.544103
O  0.453167 -2.225625 -0.086867
O  0.123209 -0.975853 2.046983
O  -0.500861 -0.139168 -2.118179
O  -4.552774 0.910475 2.573211
N  -1.094016 -0.207272 0.068404
N  -2.506999 0.712999 -1.534226
N  -4.578982 1.63378 -1.315562
N  -3.4707 0.788247 0.576911
N  -5.612884 1.728907 0.796673
C  2.55748 -0.017001 -0.78639
C  2.74396 -1.259714 -1.617766
C  1.574901 0.193619 0.187651
C  3.45954 -2.417821 -0.917544
C  3.458114 1.030321 -0.991485
C  1.510104 1.377829 0.923198
C  4.881769 -2.137664 -0.522486
C  3.399489 2.211385 -0.275116
C  2.422039 2.388313 0.69368
C  -1.307013 0.096726 -1.243772
C  -3.551336 1.054944 -0.719687
C  -5.588017 1.956209 -0.509341
C  -4.530172 1.142543 1.283145
C  -6.753045 2.642995 -1.121797
C  -3.432436 0.264984 3.181631
H  1.790734 -1.634782 -1.977994
H  3.303938 -0.981637 -2.510771
H  2.921579 -2.733448 -0.023964
H  3.470009 -3.272075 -1.596832
H  4.225786 0.911056 -1.745812
H  0.745099 1.525649 1.673918
H  4.118668 2.994562 -0.47395
H  2.36482 3.304721 1.264051
H  -1.826621 0.026788 0.749862
H  -2.632555 0.934745 -2.513752
H  -6.995319 2.211788 -2.091148
H  -7.625404 2.602761 -0.475539
H  -6.502175 3.692793 -1.289231
H  -3.687148 0.16534 4.23227
H  -2.528666 0.867219 3.091227
H  -3.267256 -0.726328 2.760712
elementType: S F O N C H
totalener: -1853.88150731 hartree
nucrepener: 2985.11446140 hartree
electener: -4838.99596871 hartree
oneelecener: -8482.32153092 hartree
twoeener: 3643.32556221 hartree
cpcmener: -0.04460067 hartree
kineticenergy: 1847.39245419 hartree
xcener: -150.166259527501 hartree
chargesum: -0.0000000
charge: 0.889854 -0.191135 -0.188347 -0.193099 -0.507036 -0.526608 -0.480086 -0.277177 -0.203255 -0.127013 -0.410772 -0.425923 -0.369510 0.099958 -0.102958 -0.140577 -0.177325 -0.179831 -0.061868 0.510604 -0.091999 -0.207637 0.390666 0.402886 0.327518 0.460535 -0.239811 -0.133544 0.104127 0.111411 0.102420 0.118051 0.138109 0.133562 0.167350 0.166614 0.217795 0.195352 0.105015 0.097182 0.116813 0.139896 0.119068 0.120725
qa: 0.8899 -0.1911 -0.1883 -0.1931 -0.5070 -0.5266 -0.4801 -0.2772 -0.2033 -0.1270 -0.4108 -0.4259 -0.3695 0.1000 -0.1030 -0.1406 -0.1773 -0.1798 -0.0619 0.5106 -0.0920 -0.2076 0.3907 0.4029 0.3275 0.4605 -0.2398 -0.1335 0.1041 0.1114 0.1024 0.1181 0.1381 0.1336 0.1674 0.1666 0.2178 0.1954 0.1050 0.0972 0.1168 0.1399 0.1191 0.1207
va: 5.7800 1.1059 1.0961 1.1002 1.9789 1.9593 2.0338 2.1348 3.1050 3.2171 3.0131 2.9546 3.0049 3.4596 3.7761 3.6791 3.8745 3.9476 3.9111 4.3821 3.8885 3.9698 4.3745 4.2182 3.9576 4.2181 3.9316 3.8500 1.0354 1.0082 1.0380 1.0199 1.0065 1.0104 0.9848 0.9883 1.0522 1.0164 1.0079 1.0161 0.9992 0.9979 0.9890 0.9909
dispcorr: -0.024347851 hartree
energy: -1853.905855166241
dipole: -26.45760 25.06643 -1.39118 15.25761 -12.91383 2.34378 0.61821 -1.06397 -0.44576
magnitude: 2.76177 au
magnitude: 7.01985 debye
