program: Orca
programVersion: 4.2.1
elementType: S F F F O O O O N N N N N C C C C C C C C C C C C C C C H H H H H H H H H H H H H H H H
charge: 0
multiplicity: 1
keywords: wb97x-d3
keywords: def2-TZVPP
keywords: def2/J RIJCOSX GRIDX6 NOFINALGRIDX
keywords: grid4 nofinalgrid
keywords: scfconv7
keywords: smallprint printgap noloewdin
keywords: NOSOSCF
formula: C15H16F3N5O4S
InChI: InChI=1S/C15H16F3N5O4S/c1-9-19-12(22-14(20-9)27-2)21-13(24)23-28(25,26)11-6-4-3-5-10(11)7-8-15(16,17)18/h3-6,21,23H,7-8H2,1-2H3
44 atoms
S  1.062106 1.777515 -1.223779
F  1.989452 -3.881547 -0.293812
F  2.610075 -3.752392 -2.350827
F  0.747362 -2.871337 -1.72906
O  0.954775 3.177962 -1.582388
O  1.070149 0.78796 -2.286771
O  0.03847 2.921502 1.315823
O  -5.67582 -0.683143 2.066049
N  -0.244979 1.340975 -0.291244
N  -1.789232 1.595639 1.42158
N  -2.397618 -0.110382 -0.037492
N  -3.739728 0.483247 1.798137
N  -4.407527 -1.250165 0.338245
C  2.841622 0.30271 0.309994
C  2.101125 -0.986222 0.067935
C  2.47202 1.561583 -0.176458
C  2.74233 -1.776604 -1.073931
C  4.007916 0.24191 1.068384
C  3.221833 2.702323 0.089906
C  2.024977 -3.065484 -1.359337
C  4.774171 1.366678 1.326426
C  4.38036 2.603027 0.838708
C  -0.612004 2.019074 0.836629
C  -2.664661 0.616812 1.034005
C  -3.304361 -1.04104 -0.348887
C  -4.570696 -0.458827 1.398718
C  -3.024025 -1.870146 -1.5474
C  -5.961583 0.095662 3.228887
H  2.1474 -1.568817 0.988956
H  1.044241 -0.823011 -0.128123
H  2.757206 -1.184916 -1.989507
H  3.779215 -2.01546 -0.829299
H  4.318839 -0.716149 1.466515
H  2.91211 3.666666 -0.284786
H  5.677337 1.276045 1.914392
H  4.966214 3.488707 1.04039
H  -0.877953 0.595645 -0.627801
H  -2.047615 2.10582 2.25685
H  -3.792811 -2.620702 -1.70335
H  -2.963218 -1.235616 -2.432458
H  -2.058401 -2.365643 -1.443157
H  -6.047091 1.154345 2.98895
H  -5.20323 -0.045165 3.997561
H  -6.91675 -0.268714 3.594841
elementType: S F O N C H
totalener: -1853.88567380 hartree
nucrepener: 3007.36302455 hartree
electener: -4861.24869835 hartree
oneelecener: -8526.70127527 hartree
twoeener: 3665.45257692 hartree
cpcmener: -0.04836440 hartree
kineticenergy: 1847.39666386 hartree
xcener: -150.168005049662 hartree
chargesum: 0.0000000
charge: 0.887275 -0.191544 -0.187314 -0.187693 -0.516034 -0.519801 -0.472002 -0.278172 -0.216191 -0.130918 -0.417211 -0.413340 -0.366648 0.044477 -0.135329 -0.120331 -0.141774 -0.195782 -0.035089 0.501801 -0.107414 -0.185601 0.391361 0.398920 0.327466 0.471088 -0.249062 -0.114520 0.120193 0.086743 0.111901 0.116224 0.143674 0.151519 0.167386 0.167428 0.207183 0.197243 0.100804 0.115832 0.101268 0.119349 0.119538 0.133098
qa: 0.8873 -0.1915 -0.1873 -0.1877 -0.5160 -0.5198 -0.4720 -0.2782 -0.2162 -0.1309 -0.4172 -0.4133 -0.3666 0.0445 -0.1353 -0.1203 -0.1418 -0.1958 -0.0351 0.5018 -0.1074 -0.1856 0.3914 0.3989 0.3275 0.4711 -0.2491 -0.1145 0.1202 0.0867 0.1119 0.1162 0.1437 0.1515 0.1674 0.1674 0.2072 0.1972 0.1008 0.1158 0.1013 0.1193 0.1195 0.1331
va: 5.7855 1.1018 1.1122 1.1023 1.9800 1.9562 2.0451 2.1272 3.0736 3.2155 3.0082 2.9588 3.0174 3.6221 3.7635 3.7417 3.8051 3.9795 3.8382 4.4095 3.8949 3.9477 4.3901 4.2101 3.9265 4.2239 3.9284 3.8418 1.0196 1.0518 1.0404 1.0282 0.9999 1.0170 0.9859 0.9878 1.0747 1.0130 1.0198 1.0002 1.0098 0.9945 0.9945 0.9941
dispcorr: -0.023614082 hartree
energy: -1853.909287882916
dipole: -7.28592 7.24748 -0.03844 8.88997 -9.62379 -0.73382 12.58711 -9.80778 2.77933
magnitude: 2.87483 au
magnitude: 7.30723 debye
