program: Orca
programVersion: 4.2.1
elementType: S F F F O O O O N N N N N C C C C C C C C C C C C C C C H H H H H H H H H H H H H H H H
charge: 0
multiplicity: 1
keywords: wb97x-d3
keywords: def2-TZVPP
keywords: def2/J RIJCOSX GRIDX6 NOFINALGRIDX
keywords: grid4 nofinalgrid
keywords: scfconv7
keywords: smallprint printgap noloewdin
keywords: NOSOSCF
formula: C15H16F3N5O4S
InChI: InChI=1S/C15H16F3N5O4S/c1-9-19-12(22-14(20-9)27-2)21-13(24)23-28(25,26)11-6-4-3-5-10(11)7-8-15(16,17)18/h3-6,21,23H,7-8H2,1-2H3
44 atoms
S  1.107085 1.732573 -1.295048
F  2.630197 -3.827304 -2.17285
F  0.756706 -2.934289 -1.602419
F  1.983326 -3.89567 -0.121253
O  1.025536 3.11821 -1.711393
O  1.138108 0.697921 -2.313385
O  0.015806 2.991492 1.15828
O  -5.673862 -0.624137 2.004047
N  -0.235748 1.346451 -0.387961
N  -1.800159 1.654571 1.297362
N  -2.382373 -0.114398 -0.096285
N  -3.744095 0.543548 1.702845
N  -4.387524 -1.252994 0.31055
C  2.81075 0.308252 0.369045
C  2.072616 -0.985245 0.144808
C  2.474588 1.548163 -0.186332
C  2.739364 -1.812965 -0.955143
C  3.938605 0.2724 1.184999
C  3.219706 2.694523 0.068457
C  2.029977 -3.112255 -1.210672
C  4.699532 1.402817 1.434189
C  4.339842 2.619755 0.876406
C  -0.621256 2.065082 0.706712
C  -2.663848 0.654369 0.942353
C  -3.279455 -1.064269 -0.375571
C  -4.565034 -0.419667 1.335698
C  -2.984754 -1.941591 -1.535702
C  -5.974911 0.205273 3.127627
H  2.091466 -1.539263 1.0841
H  1.022044 -0.823215 -0.083894
H  2.772242 -1.254406 -1.890576
H  3.771143 -2.041039 -0.680581
H  4.222335 -0.669813 1.637436
H  2.936211 3.644673 -0.359345
H  5.571553 1.332255 2.070096
H  4.9215 3.509802 1.07081
H  -0.856751 0.582945 -0.703721
H  -2.072093 2.199697 2.105814
H  -2.021902 -2.434441 -1.398104
H  -3.75265 -2.697182 -1.670683
H  -2.910773 -1.344153 -2.445112
H  -6.928747 -0.151363 3.504519
H  -6.069705 1.250446 2.837076
H  -5.22028 0.109372 3.906821
elementType: S F O N C H
totalener: -1853.88566216 hartree
nucrepener: 3010.39761774 hartree
electener: -4864.28327989 hartree
oneelecener: -8532.74470421 hartree
twoeener: 3668.46142432 hartree
cpcmener: -0.04812769 hartree
kineticenergy: 1847.39788291 hartree
xcener: -150.168128497759 hartree
chargesum: -0.0000000
charge: 0.887492 -0.187396 -0.187408 -0.191581 -0.514303 -0.519562 -0.472925 -0.278797 -0.215739 -0.131352 -0.418758 -0.413414 -0.366783 0.045934 -0.137389 -0.123119 -0.139832 -0.195918 -0.033795 0.501244 -0.106766 -0.186781 0.391722 0.400049 0.327868 0.470503 -0.249849 -0.114237 0.119593 0.087238 0.112220 0.116354 0.143539 0.152266 0.167486 0.167732 0.207616 0.197009 0.101949 0.100634 0.115599 0.133041 0.119340 0.119276
qa: 0.8875 -0.1874 -0.1874 -0.1916 -0.5143 -0.5196 -0.4729 -0.2788 -0.2157 -0.1314 -0.4188 -0.4134 -0.3668 0.0459 -0.1374 -0.1231 -0.1398 -0.1959 -0.0338 0.5012 -0.1068 -0.1868 0.3917 0.4000 0.3279 0.4705 -0.2498 -0.1142 0.1196 0.0872 0.1122 0.1164 0.1435 0.1523 0.1675 0.1677 0.2076 0.1970 0.1019 0.1006 0.1156 0.1330 0.1193 0.1193
va: 5.7834 1.1122 1.1025 1.1017 1.9816 1.9570 2.0437 2.1268 3.0746 3.2162 3.0071 2.9591 3.0173 3.6174 3.7671 3.7420 3.8024 3.9800 3.8356 4.4100 3.8932 3.9485 4.3890 4.2085 3.9256 4.2247 3.9276 3.8419 1.0199 1.0502 1.0413 1.0280 1.0000 1.0166 0.9857 0.9877 1.0740 1.0132 1.0098 1.0200 1.0003 0.9941 0.9945 0.9946
dispcorr: -0.023694194 hartree
energy: -1853.909356352434
dipole: -7.56128 7.46106 -0.10022 9.28743 -9.90867 -0.62124 12.35838 -9.52858 2.82980
magnitude: 2.89892 au
magnitude: 7.36847 debye
