program: Orca
programVersion: 4.2.1
elementType: S F F F O O O O N N N N N C C C C C C C C C C C C C C C H H H H H H H H H H H H H H H H
charge: 0
multiplicity: 1
keywords: wb97x-d3
keywords: def2-TZVPP
keywords: def2/J RIJCOSX GRIDX6 NOFINALGRIDX
keywords: grid4 nofinalgrid
keywords: scfconv7
keywords: smallprint printgap noloewdin
keywords: NOSOSCF
formula: C15H16F3N5O4S
InChI: InChI=1S/C15H16F3N5O4S/c1-9-19-12(22-14(20-9)27-2)21-13(24)23-28(25,26)11-6-4-3-5-10(11)7-8-15(16,17)18/h3-6,21,23H,7-8H2,1-2H3
44 atoms
S  1.1438 1.518137 1.586965
F  0.520409 -2.819576 -2.554664
F  0.028986 -2.624987 -0.469883
F  1.834133 -3.635185 -1.056919
O  1.173965 0.471113 2.5937
O  0.877849 2.877867 2.011967
O  0.216879 2.702171 -0.957414
O  -3.267992 -1.746154 1.776188
N  -0.05676 1.015691 0.537545
N  -1.643382 1.431218 -1.115953
N  -3.751668 0.602466 -1.370171
N  -2.387664 -0.189173 0.371586
N  -4.576697 -1.008749 0.134269
C  3.12661 0.328302 0.047747
C  2.444877 -1.014642 0.056266
C  2.62344 1.503412 0.615027
C  1.789728 -1.281276 -1.301132
C  4.33754 0.430412 -0.632808
C  3.288745 2.719854 0.501409
C  1.048565 -2.587453 -1.34525
C  5.013416 1.633274 -0.749974
C  4.487049 2.784496 -0.184869
C  -0.447531 1.786266 -0.525508
C  -2.625317 0.580324 -0.681933
C  -4.703033 -0.212731 -0.917991
C  -3.398984 -0.957567 0.737231
C  -6.003897 -0.195517 -1.632339
C  -2.029769 -1.75624 2.489163
H  3.203276 -1.773618 0.251546
H  1.719445 -1.101877 0.8596
H  1.086373 -0.48685 -1.556027
H  2.543602 -1.293681 -2.090302
H  4.760524 -0.461188 -1.07907
H  2.881015 3.616943 0.942551
H  5.95318 1.670384 -1.283676
H  5.003295 3.729789 -0.274109
H  -0.717251 0.300757 0.874815
H  -1.888975 1.992947 -1.921548
H  -6.533948 0.727779 -1.389508
H  -5.854845 -0.20439 -2.710652
H  -6.630139 -1.034478 -1.343392
H  -1.210071 -2.094824 1.856746
H  -2.165002 -2.464449 3.300651
H  -1.80092 -0.77674 2.907857
elementType: S F O N C H
totalener: -1853.88300114 hartree
nucrepener: 3099.50438813 hartree
electener: -4953.38738926 hartree
oneelecener: -8710.40481853 hartree
twoeener: 3757.01742927 hartree
cpcmener: -0.04573362 hartree
kineticenergy: 1847.40377456 hartree
xcener: -150.167525273223 hartree
chargesum: 0.0000000
charge: 0.891281 -0.186930 -0.187070 -0.187736 -0.519317 -0.509178 -0.460034 -0.275054 -0.223241 -0.125380 -0.407821 -0.420147 -0.365876 0.048599 -0.113656 -0.124990 -0.172907 -0.198427 -0.037461 0.505029 -0.106506 -0.184142 0.356554 0.397433 0.330493 0.458976 -0.238544 -0.125647 0.123019 0.093402 0.109030 0.127955 0.144914 0.153260 0.167421 0.168053 0.210552 0.197645 0.114972 0.106865 0.096443 0.112477 0.140621 0.115069
qa: 0.8913 -0.1869 -0.1871 -0.1877 -0.5193 -0.5092 -0.4600 -0.2751 -0.2232 -0.1254 -0.4078 -0.4201 -0.3659 0.0486 -0.1137 -0.1250 -0.1729 -0.1984 -0.0375 0.5050 -0.1065 -0.1841 0.3566 0.3974 0.3305 0.4590 -0.2385 -0.1256 0.1230 0.0934 0.1090 0.1280 0.1449 0.1533 0.1674 0.1681 0.2106 0.1976 0.1150 0.1069 0.0964 0.1125 0.1406 0.1151
va: 5.7643 1.1129 1.0971 1.1092 1.9507 1.9912 2.0531 2.1388 3.0715 3.2001 3.0178 2.9379 3.0094 3.6155 3.7327 3.7452 3.8319 3.9805 3.8259 4.4030 3.9015 3.9456 4.4001 4.2220 3.9533 4.2197 3.9314 3.8536 1.0209 1.0515 1.0346 1.0286 1.0004 1.0155 0.9860 0.9876 1.0609 1.0151 0.9999 1.0064 1.0169 0.9926 0.9986 0.9949
dispcorr: -0.025902896 hartree
energy: -1853.908904031894
dipole: -1.99437 2.77725 0.78288 8.28405 -8.91282 -0.62877 1.46694 -3.15225 -1.68531
magnitude: 1.96177 au
magnitude: 4.98642 debye
