program: Orca
programVersion: 4.2.1
elementType: S F F F O O O O N N N N N C C C C C C C C C C C C C C C H H H H H H H H H H H H H H H H
charge: 0
multiplicity: 1
keywords: wb97x-d3
keywords: def2-TZVPP
keywords: def2/J RIJCOSX GRIDX6 NOFINALGRIDX
keywords: grid4 nofinalgrid
keywords: scfconv7
keywords: smallprint printgap noloewdin
keywords: NOSOSCF
formula: C15H16F3N5O4S
InChI: InChI=1S/C15H16F3N5O4S/c1-9-19-12(22-14(20-9)27-2)21-13(24)23-28(25,26)11-6-4-3-5-10(11)7-8-15(16,17)18/h3-6,21,23H,7-8H2,1-2H3
44 atoms
S  1.208643 1.486913 1.646604
F  -0.158095 -2.439954 -0.573209
F  1.572842 -3.546177 -1.209185
F  0.293025 -2.613822 -2.667825
O  1.256797 0.401194 2.610983
O  0.989294 2.833959 2.132792
O  0.196921 2.783746 -0.81368
O  -3.145001 -1.8643 1.762916
N  -0.041663 1.047535 0.629436
N  -1.660756 1.509991 -0.977638
N  -3.722728 0.58713 -1.288716
N  -2.342468 -0.19377 0.444739
N  -4.470029 -1.136994 0.129381
C  3.09907 0.31862 -0.021834
C  2.377306 -1.003415 -0.050705
C  2.649771 1.479362 0.61699
C  1.673903 -1.188814 -1.397622
C  4.288046 0.420171 -0.740242
C  3.345189 2.681656 0.535931
C  0.851202 -2.44493 -1.461415
C  4.993925 1.608933 -0.825024
C  4.520858 2.746195 -0.188733
C  -0.453468 1.849466 -0.400868
C  -2.604381 0.597409 -0.586791
C  -4.631022 -0.300274 -0.886262
C  -3.307847 -1.041375 0.756031
C  -5.90252 -0.363444 -1.649507
C  -1.927276 -1.818694 2.510118
H  3.116758 -1.793881 0.086851
H  1.674983 -1.106101 0.771832
H  1.016995 -0.344591 -1.613676
H  2.407522 -1.223442 -2.205127
H  4.670099 -0.460477 -1.241928
H  2.977801 3.566762 1.033855
H  5.915617 1.645803 -1.389692
H  5.061136 3.680253 -0.252178
H  -0.689725 0.313336 0.949013
H  -1.924146 2.089942 -1.764626
H  -6.249844 0.634432 -1.91051
H  -5.734144 -0.901671 -2.584813
H  -6.675726 -0.885553 -1.092872
H  -2.040918 -2.554969 3.299669
H  -1.769838 -0.838347 2.958756
H  -1.072233 -2.0919 1.892829
elementType: S F O N C H
totalener: -1853.88313176 hartree
nucrepener: 3115.12632096 hartree
electener: -4969.00945272 hartree
oneelecener: -8741.66436936 hartree
twoeener: 3772.65491664 hartree
cpcmener: -0.04600067 hartree
kineticenergy: 1847.39710965 hartree
xcener: -150.166912491837 hartree
chargesum: -0.0000000
charge: 0.890631 -0.187342 -0.187590 -0.187666 -0.518896 -0.509218 -0.460642 -0.274417 -0.219275 -0.121145 -0.406307 -0.417295 -0.364205 0.045577 -0.103644 -0.127049 -0.180159 -0.197499 -0.037676 0.508554 -0.107613 -0.184220 0.352157 0.391553 0.330357 0.453114 -0.239636 -0.124167 0.122528 0.088586 0.111959 0.129387 0.145511 0.153976 0.167402 0.167979 0.210033 0.198243 0.105544 0.116421 0.097687 0.140691 0.116556 0.111218
qa: 0.8906 -0.1873 -0.1876 -0.1877 -0.5189 -0.5092 -0.4606 -0.2744 -0.2193 -0.1211 -0.4063 -0.4173 -0.3642 0.0456 -0.1036 -0.1270 -0.1802 -0.1975 -0.0377 0.5086 -0.1076 -0.1842 0.3522 0.3916 0.3304 0.4531 -0.2396 -0.1242 0.1225 0.0886 0.1120 0.1294 0.1455 0.1540 0.1674 0.1680 0.2100 0.1982 0.1055 0.1164 0.0977 0.1407 0.1166 0.1112
va: 5.7692 1.0964 1.1098 1.1124 1.9514 1.9917 2.0521 2.1386 3.0700 3.2024 3.0189 2.9331 3.0102 3.6240 3.7331 3.7453 3.8390 3.9811 3.8291 4.3976 3.9017 3.9462 4.4050 4.2232 3.9530 4.2265 3.9315 3.8527 1.0208 1.0512 1.0295 1.0280 1.0002 1.0151 0.9859 0.9876 1.0634 1.0145 1.0077 0.9995 1.0158 0.9987 0.9932 0.9928
dispcorr: -0.026355280 hartree
energy: -1853.909487039004
dipole: -0.96545 1.74932 0.78386 7.20303 -7.89161 -0.68858 1.40279 -3.18801 -1.78522
magnitude: 2.06775 au
magnitude: 5.25580 debye
