program: Orca
programVersion: 4.2.1
elementType: S F F F O O O O N N N N N C C C C C C C C C C C C C C C H H H H H H H H H H H H H H H H
charge: 0
multiplicity: 1
keywords: wb97x-d3
keywords: def2-TZVPP
keywords: def2/J RIJCOSX GRIDX6 NOFINALGRIDX
keywords: grid4 nofinalgrid
keywords: scfconv7
keywords: smallprint printgap noloewdin
keywords: NOSOSCF
formula: C15H16F3N5O4S
InChI: InChI=1S/C15H16F3N5O4S/c1-9-19-12(22-14(20-9)27-2)21-13(24)23-28(25,26)11-6-4-3-5-10(11)7-8-15(16,17)18/h3-6,21,23H,7-8H2,1-2H3
44 atoms
S  0.923274 0.931227 -1.474202
F  1.91816 -3.114596 -1.660102
F  3.815323 -3.901208 -1.025571
F  3.632874 -1.817484 -1.527592
O  0.897411 2.126821 -2.291052
O  0.870997 -0.364039 -2.123144
O  -0.02575 2.948271 0.478954
O  -6.178149 0.524305 1.980161
N  -0.410416 0.918114 -0.463821
N  -1.984265 1.921535 0.924687
N  -2.777851 -0.100494 0.092494
N  -4.085273 1.262607 1.490349
N  -4.947573 -0.771625 0.663817
C  2.620372 0.006329 0.529182
C  1.84375 -1.273605 0.731547
C  2.304089 1.032891 -0.366291
C  2.665627 -2.545113 0.512277
C  3.734151 0.21255 1.34218
C  3.065469 2.194815 -0.453927
C  3.002624 -2.835519 -0.923832
C  4.505454 1.358537 1.259373
C  4.174868 2.355079 0.353967
C  -0.747309 1.992783 0.309379
C  -2.973878 0.985428 0.823099
C  -3.80037 -0.957122 0.042847
C  -5.031399 0.353218 1.370932
C  -3.603789 -2.201298 -0.745019
C  -6.379973 1.704954 2.75624
H  1.513957 -1.290818 1.77226
H  0.934896 -1.323852 0.139886
H  3.598184 -2.507801 1.077924
H  2.105016 -3.397948 0.899706
H  4.002271 -0.545778 2.067723
H  2.796295 2.977305 -1.148009
H  5.363837 1.474304 1.907857
H  4.767155 3.256813 0.281776
H  -1.112749 0.171951 -0.583522
H  -2.204924 2.721792 1.504197
H  -3.004252 -2.906937 -0.165638
H  -4.553894 -2.675207 -0.977218
H  -3.060299 -1.997568 -1.666307
H  -7.392371 1.629839 3.143225
H  -6.292667 2.604028 2.14677
H  -5.678601 1.762032 3.588272
elementType: S F O N C H
totalener: -1853.88775279 hartree
nucrepener: 3011.66834662 hartree
electener: -4865.55609941 hartree
oneelecener: -8536.10219909 hartree
twoeener: 3670.54609968 hartree
cpcmener: -0.04536354 hartree
kineticenergy: 1847.40078344 hartree
xcener: -150.165378578907 hartree
chargesum: -0.0000000
charge: 0.878399 -0.187028 -0.191505 -0.186203 -0.501675 -0.500263 -0.448872 -0.269443 -0.224737 -0.135525 -0.419320 -0.414045 -0.361962 0.021460 -0.084660 -0.111912 -0.172371 -0.182855 -0.023826 0.504822 -0.120607 -0.179626 0.375103 0.399191 0.319873 0.457565 -0.251416 -0.116869 0.124707 0.072446 0.103276 0.119438 0.135909 0.149348 0.162618 0.163327 0.210640 0.193990 0.116639 0.102807 0.105497 0.132487 0.117250 0.117925
qa: 0.8784 -0.1870 -0.1915 -0.1862 -0.5017 -0.5003 -0.4489 -0.2694 -0.2247 -0.1355 -0.4193 -0.4140 -0.3620 0.0215 -0.0847 -0.1119 -0.1724 -0.1829 -0.0238 0.5048 -0.1206 -0.1796 0.3751 0.3992 0.3199 0.4576 -0.2514 -0.1169 0.1247 0.0724 0.1033 0.1194 0.1359 0.1493 0.1626 0.1633 0.2106 0.1940 0.1166 0.1028 0.1055 0.1325 0.1172 0.1179
va: 5.8017 1.1065 1.1053 1.1012 2.0011 1.9795 2.0745 2.1360 3.0708 3.2049 3.0053 2.9582 3.0136 3.6510 3.7826 3.7294 3.9217 3.9746 3.8330 4.3854 3.9080 3.9436 4.4067 4.2085 3.9284 4.2429 3.9329 3.8466 1.0022 1.0529 1.0225 1.0201 1.0028 1.0187 0.9877 0.9890 1.0627 1.0157 0.9988 1.0160 1.0061 0.9944 0.9951 0.9945
dispcorr: -0.023409352 hartree
energy: -1853.911162142373
dipole: -16.38116 15.37953 -1.00162 7.63248 -7.95467 -0.32218 17.52455 -13.72849 3.79606
magnitude: 3.93918 au
magnitude: 10.01260 debye
