program: Orca
programVersion: 4.2.1
elementType: S F F F O O O O N N N N N C C C C C C C C C C C C C C C H H H H H H H H H H H H H H H H
charge: 0
multiplicity: 1
keywords: wb97x-d3
keywords: def2-TZVPP
keywords: def2/J RIJCOSX GRIDX6 NOFINALGRIDX
keywords: grid4 nofinalgrid
keywords: scfconv7
keywords: smallprint printgap noloewdin
keywords: NOSOSCF
formula: C15H16F3N5O4S
InChI: InChI=1S/C15H16F3N5O4S/c1-9-19-12(22-14(20-9)27-2)21-13(24)23-28(25,26)11-6-4-3-5-10(11)7-8-15(16,17)18/h3-6,21,23H,7-8H2,1-2H3
44 atoms
S  1.106329 0.461669 1.460801
F  3.86567 -2.066754 0.376548
F  3.97993 -3.932887 -0.688655
F  2.203413 -3.433756 0.41432
O  1.131788 -0.961398 1.738111
O  1.181575 1.390495 2.56975
O  -0.0126 2.874479 0.166043
O  -6.443716 0.986321 -0.820451
N  -0.342637 0.679646 0.648958
N  -2.05594 1.998467 -0.214136
N  -2.847763 -0.113243 0.355521
N  -4.25443 1.534663 -0.554478
N  -5.125565 -0.570067 0.056547
C  2.542008 0.177798 -0.909088
C  1.746555 -1.025758 -1.35726
C  2.340986 0.905325 0.267667
C  2.592504 -2.274444 -1.613081
C  3.542894 0.641045 -1.762128
C  3.10739 2.023454 0.58342
C  3.154649 -2.91795 -0.375887
C  4.317317 1.746483 -1.457564
C  4.105222 2.440162 -0.275978
C  -0.74322 1.911732 0.211814
C  -3.077858 1.095681 -0.129926
C  -3.912207 -0.915344 0.436098
C  -5.234361 0.661819 -0.436343
C  -3.698056 -2.266299 1.016017
C  -6.667229 2.281507 -1.377576
H  0.93041 -1.271097 -0.685068
H  1.274538 -0.768458 -2.307687
H  1.977961 -3.018475 -2.123361
H  3.423051 -2.049839 -2.284359
H  3.716975 0.124649 -2.698176
H  2.927687 2.574038 1.494942
H  5.084874 2.069171 -2.148414
H  4.701957 3.307069 -0.027949
H  -1.061059 -0.056727 0.728154
H  -2.313251 2.906791 -0.579574
H  -2.790091 -2.719114 0.620002
H  -3.569648 -2.181831 2.097254
H  -4.546006 -2.917641 0.822075
H  -6.088726 2.428639 -2.289198
H  -6.428023 3.070846 -0.665539
H  -7.726942 2.31858 -1.613877
elementType: S F O N C H
totalener: -1853.88743190 hartree
nucrepener: 3005.35308013 hartree
electener: -4859.24051204 hartree
oneelecener: -8523.54480212 hartree
twoeener: 3664.30429008 hartree
cpcmener: -0.04493521 hartree
kineticenergy: 1847.40296645 hartree
xcener: -150.165381081282 hartree
chargesum: 0.0000000
charge: 0.880463 -0.185797 -0.191842 -0.186599 -0.501689 -0.501903 -0.448284 -0.269539 -0.227578 -0.135373 -0.420703 -0.414398 -0.361370 0.018462 -0.089579 -0.103299 -0.169360 -0.183131 -0.023145 0.504016 -0.116912 -0.182500 0.374785 0.399792 0.319732 0.458993 -0.249994 -0.117253 0.074354 0.125205 0.119227 0.102210 0.134628 0.148832 0.162467 0.162934 0.208554 0.193939 0.105254 0.117757 0.100534 0.117728 0.117504 0.132879
qa: 0.8805 -0.1858 -0.1918 -0.1866 -0.5017 -0.5019 -0.4483 -0.2695 -0.2276 -0.1354 -0.4207 -0.4144 -0.3614 0.0185 -0.0896 -0.1033 -0.1694 -0.1831 -0.0231 0.5040 -0.1169 -0.1825 0.3748 0.3998 0.3197 0.4590 -0.2500 -0.1173 0.0744 0.1252 0.1192 0.1022 0.1346 0.1488 0.1625 0.1629 0.2086 0.1939 0.1053 0.1178 0.1005 0.1177 0.1175 0.1329
va: 5.7959 1.1011 1.1050 1.1068 1.9765 2.0013 2.0746 2.1362 3.0688 3.2029 3.0042 2.9578 3.0136 3.6519 3.7839 3.7282 3.9226 3.9745 3.8287 4.3843 3.9041 3.9439 4.4055 4.2074 3.9323 4.2407 3.9328 3.8464 1.0524 1.0014 1.0204 1.0226 1.0034 1.0186 0.9875 0.9891 1.0648 1.0158 1.0046 0.9988 1.0171 0.9949 0.9950 0.9942
dispcorr: -0.023322628 hartree
energy: -1853.910754531900
dipole: -19.14970 17.61537 -1.53433 12.05718 -11.30090 0.75628 -11.41187 7.94217 -3.46970
magnitude: 3.86846 au
magnitude: 9.83283 debye
