program: Orca
programVersion: 4.2.1
elementType: S F F F O O O O N N N N N C C C C C C C C C C C C C C C H H H H H H H H H H H H H H H H
charge: 0
multiplicity: 1
keywords: wb97x-d3
keywords: def2-TZVPP
keywords: def2/J RIJCOSX GRIDX6 NOFINALGRIDX
keywords: grid4 nofinalgrid
keywords: scfconv7
keywords: smallprint printgap noloewdin
keywords: NOSOSCF
formula: C15H16F3N5O4S
InChI: InChI=1S/C15H16F3N5O4S/c1-9-19-12(22-14(20-9)27-2)21-13(24)23-28(25,26)11-6-4-3-5-10(11)7-8-15(16,17)18/h3-6,21,23H,7-8H2,1-2H3
44 atoms
S  1.084502 1.524059 1.626389
F  0.428384 -3.07345 -1.28711
F  1.71011 -3.766871 0.292727
F  2.176539 -4.239683 -1.754585
O  1.099893 0.326142 2.446066
O  1.014782 2.817202 2.2730
O  -0.057445 3.245553 -0.509161
O  -3.238441 -1.926521 1.168127
N  -0.261632 1.311637 0.662626
N  -1.956954 2.049271 -0.748603
N  -4.043869 1.209948 -1.10001
N  -2.529842 0.034769 0.259542
N  -4.692583 -0.812103 -0.091229
C  2.800367 0.384771 -0.246941
C  2.022117 -0.90543 -0.165607
C  2.444713 1.527127 0.490884
C  2.538217 -2.015078 -1.072549
C  3.910155 0.508567 -1.076363
C  3.152518 2.717698 0.398159
C  1.716066 -3.269064 -0.953563
C  4.630173 1.691618 -1.171059
C  4.254368 2.800789 -0.435933
C  -0.703601 2.269325 -0.209004
C  -2.868074 1.057787 -0.514816
C  -4.927609 0.248373 -0.851264
C  -3.478735 -0.871155 0.430319
C  -6.264234 0.361422 -1.491702
C  -1.944082 -2.097414 1.74194
H  2.02809 -1.252851 0.867293
H  0.980655 -0.695412 -0.421697
H  2.521201 -1.708506 -2.120321
H  3.569203 -2.275147 -0.82402
H  4.235284 -0.332833 -1.671395
H  2.853579 3.583985 0.969899
H  5.488252 1.739167 -1.82838
H  4.806032 3.727852 -0.507563
H  -0.887014 0.523734 0.873235
H  -2.272292 2.781146 -1.373251
H  -6.230774 -0.098312 -2.482375
H  -7.023036 -0.158863 -0.911877
H  -6.549478 1.402839 -1.624296
H  -1.992304 -3.025711 2.303937
H  -1.691776 -1.284839 2.423604
H  -1.177628 -2.192354 0.972093
elementType: S F O N C H
totalener: -1853.88884068 hartree
nucrepener: 3036.14201091 hartree
electener: -4890.03085159 hartree
oneelecener: -8583.41360450 hartree
twoeener: 3693.38275291 hartree
cpcmener: -0.04015972 hartree
kineticenergy: 1847.38701106 hartree
xcener: -150.166582351856 hartree
chargesum: 0.0000000
charge: 0.882326 -0.193388 -0.192021 -0.184449 -0.511038 -0.493381 -0.443476 -0.267546 -0.226606 -0.134149 -0.402701 -0.427319 -0.363029 0.051302 -0.098543 -0.158608 -0.170504 -0.194043 -0.018083 0.513663 -0.111295 -0.182935 0.379541 0.400126 0.319198 0.451445 -0.239142 -0.116029 0.133060 0.091990 0.108969 0.110854 0.136129 0.149392 0.163225 0.163293 0.210188 0.193558 0.116031 0.101168 0.101291 0.141798 0.121122 0.088616
qa: 0.8823 -0.1934 -0.1920 -0.1844 -0.5110 -0.4934 -0.4435 -0.2675 -0.2266 -0.1341 -0.4027 -0.4273 -0.3630 0.0513 -0.0985 -0.1586 -0.1705 -0.1940 -0.0181 0.5137 -0.1113 -0.1829 0.3795 0.4001 0.3192 0.4514 -0.2391 -0.1160 0.1331 0.0920 0.1090 0.1109 0.1361 0.1494 0.1632 0.1633 0.2102 0.1936 0.1160 0.1012 0.1013 0.1418 0.1211 0.0886
va: 5.7917 1.0989 1.1015 1.1176 1.9671 2.0081 2.0800 2.1468 3.0824 3.2064 3.0181 2.9471 3.0047 3.7106 3.7837 3.8573 3.9469 3.9265 3.8339 4.4069 3.9259 3.9498 4.4022 4.2192 3.9660 4.2324 3.9297 3.8595 1.0122 1.0221 1.0170 1.0173 1.0075 1.0192 0.9881 0.9892 1.0571 1.0177 0.9994 1.0128 1.0114 0.9987 0.9946 1.0007
dispcorr: -0.024256833 hartree
energy: -1853.913097515183
dipole: -5.23604 5.76244 0.52640 10.51106 -11.01093 -0.49988 -2.58853 0.51532 -2.07320
magnitude: 2.19662 au
magnitude: 5.58337 debye
