program: Orca
programVersion: 4.2.1
elementType: S F F F O O O O N N N N N C C C C C C C C C C C C C C C H H H H H H H H H H H H H H H H
charge: 0
multiplicity: 1
keywords: wb97x-d3
keywords: def2-TZVPP
keywords: def2/J RIJCOSX GRIDX6 NOFINALGRIDX
keywords: grid4 nofinalgrid
keywords: scfconv7
keywords: smallprint printgap noloewdin
keywords: NOSOSCF
formula: C15H16F3N5O4S
InChI: InChI=1S/C15H16F3N5O4S/c1-9-19-12(22-14(20-9)27-2)21-13(24)23-28(25,26)11-6-4-3-5-10(11)7-8-15(16,17)18/h3-6,21,23H,7-8H2,1-2H3
44 atoms
S  1.036704 1.624872 -1.511817
F  0.569038 -3.242534 1.119122
F  2.381729 -4.392003 1.289357
F  1.718486 -3.700688 -0.637408
O  0.933149 2.963147 -2.050351
O  1.038051 0.497144 -2.424937
O  -0.045801 3.159961 0.785261
O  -3.301183 -1.86291 -1.20622
N  -0.278292 1.319788 -0.523973
N  -1.926861 1.93132 0.999055
N  -4.020567 1.097367 1.312261
N  -2.542736 0.008069 -0.155466
N  -4.719546 -0.822584 0.150827
C  2.804313 0.374938 0.242115
C  2.005956 -0.900791 0.132633
C  2.434841 1.556312 -0.422903
C  2.623698 -2.093369 0.850482
C  3.945076 0.446767 1.035306
C  3.162093 2.733064 -0.301526
C  1.824814 -3.351759 0.654319
C  4.684353 1.615027 1.157831
C  4.297188 2.762527 0.490187
C  -0.695433 2.20329 0.433267
C  -2.855341 0.972991 0.70046
C  -4.926142 0.176075 0.997064
C  -3.511365 -0.863497 -0.386135
C  -6.253634 0.264699 1.660178
C  -2.015567 -2.020604 -1.802888
H  1.008197 -0.715372 0.539067
H  1.876304 -1.145512 -0.921002
H  3.633855 -2.285651 0.483132
H  2.695069 -1.914551 1.925103
H  4.281244 -0.424994 1.578472
H  2.851381 3.628402 -0.82003
H  5.567879 1.61986 1.782388
H  4.866849 3.676843 0.582209
H  -0.899391 0.539061 -0.769311
H  -2.226533 2.611259 1.687051
H  -6.539289 1.301356 1.827617
H  -7.019817 -0.239013 1.075678
H  -6.204989 -0.221806 2.637306
H  -1.748474 -1.165804 -2.424787
H  -2.090379 -2.903221 -2.431621
H  -1.245951 -2.190444 -1.048922
elementType: S F O N C H
totalener: -1853.88865622 hartree
nucrepener: 3030.99477445 hartree
electener: -4884.88343067 hartree
oneelecener: -8573.11687980 hartree
twoeener: 3688.23344913 hartree
cpcmener: -0.04021147 hartree
kineticenergy: 1847.38369534 hartree
xcener: -150.165472227509 hartree
chargesum: 0.0000000
charge: 0.881889 -0.193405 -0.184491 -0.192439 -0.491585 -0.510097 -0.443893 -0.267114 -0.228535 -0.136732 -0.403558 -0.428991 -0.362740 0.060808 -0.115352 -0.158328 -0.170580 -0.193444 -0.024045 0.514349 -0.113290 -0.180336 0.380267 0.400583 0.318435 0.453016 -0.238292 -0.119118 0.099423 0.135429 0.112434 0.106902 0.136634 0.150240 0.163062 0.163472 0.212475 0.193597 0.101877 0.100304 0.115825 0.119885 0.141612 0.093845
qa: 0.8819 -0.1934 -0.1845 -0.1924 -0.4916 -0.5101 -0.4439 -0.2671 -0.2285 -0.1367 -0.4036 -0.4290 -0.3627 0.0608 -0.1154 -0.1583 -0.1706 -0.1934 -0.0240 0.5143 -0.1133 -0.1803 0.3803 0.4006 0.3184 0.4530 -0.2383 -0.1191 0.0994 0.1354 0.1124 0.1069 0.1366 0.1502 0.1631 0.1635 0.2125 0.1936 0.1019 0.1003 0.1158 0.1199 0.1416 0.0938
va: 5.7890 1.0992 1.1175 1.1015 2.0100 1.9662 2.0790 2.1460 3.0787 3.2045 3.0165 2.9460 3.0062 3.6921 3.7789 3.8607 3.9494 3.9259 3.8373 4.4076 3.9296 3.9474 4.4008 4.2197 3.9670 4.2299 3.9298 3.8578 1.0163 1.0157 1.0174 1.0169 1.0072 1.0186 0.9883 0.9890 1.0537 1.0178 1.0103 1.0138 0.9994 0.9946 0.9982 1.0013
dispcorr: -0.024124145 hartree
energy: -1853.912780361528
dipole: -5.57644 6.16026 0.58381 10.43899 -11.09116 -0.65216 3.60488 -1.58562 2.01926
magnitude: 2.20081 au
magnitude: 5.59402 debye
