program: Orca
programVersion: 4.2.1
elementType: S F F F O O O O N N N N N C C C C C C C C C C C C C C C H H H H H H H H H H H H H H H H
charge: 0
multiplicity: 1
keywords: wb97x-d3
keywords: def2-TZVPP
keywords: def2/J RIJCOSX GRIDX6 NOFINALGRIDX
keywords: grid4 nofinalgrid
keywords: scfconv7
keywords: smallprint printgap noloewdin
keywords: NOSOSCF
formula: C15H16F3N5O4S
InChI: InChI=1S/C15H16F3N5O4S/c1-9-19-12(22-14(20-9)27-2)21-13(24)23-28(25,26)11-6-4-3-5-10(11)7-8-15(16,17)18/h3-6,21,23H,7-8H2,1-2H3
44 atoms
S  0.888728 0.593497 1.389822
F  5.274858 -3.094143 -0.206772
F  3.462187 -4.129779 -0.729844
F  3.732838 -3.369454 1.265562
O  1.252816 -0.760761 1.747119
O  0.667043 1.568492 2.441497
O  0.127013 -0.742618 -1.138807
O  -6.567255 0.285665 -1.280961
N  -0.568653 0.580515 0.568558
N  -2.056738 -0.196331 -1.043344
N  -3.180447 1.007723 0.599282
N  -4.310914 0.027289 -1.213072
N  -5.510015 1.201403 0.443802
C  3.232412 0.697279 -0.15923
C  3.802312 -0.598989 0.359695
C  2.0134 1.280108 0.199152
C  3.308103 -1.79627 -0.453917
C  3.997075 1.392214 -1.098574
C  1.609349 2.51283 -0.311527
C  3.942571 -3.089973 -0.030405
C  3.59329 2.600171 -1.636971
C  2.394405 3.171996 -1.236124
C  -0.763342 -0.161722 -0.559898
C  -3.215171 0.305918 -0.52144
C  -4.363182 1.432464 1.050258
C  -5.421325 0.499931 -0.683921
C  -4.368624 2.187357 2.329873
C  -6.580774 -0.450509 -2.504029
H  4.887305 -0.52349 0.275096
H  3.585931 -0.733636 1.416056
H  2.228358 -1.901801 -0.363892
H  3.527318 -1.647946 -1.513767
H  4.945504 0.967998 -1.40451
H  0.673541 2.960605 -0.002378
H  4.221194 3.100886 -2.361936
H  2.073247 4.123996 -1.635604
H  -1.387073 1.025692 1.009404
H  -2.164106 -0.729285 -1.897216
H  -3.528452 2.878239 2.378464
H  -5.299845 2.731676 2.462857
H  -4.260374 1.488847 3.162697
H  -6.196244 -1.460905 -2.367517
H  -6.005929 0.05389 -3.280317
H  -7.623873 -0.499713 -2.803592
elementType: S F O N C H
totalener: -1853.88878215 hartree
nucrepener: 2941.55605883 hartree
electener: -4795.44484097 hartree
oneelecener: -8395.52935954 hartree
twoeener: 3600.08451856 hartree
cpcmener: -0.03904069 hartree
kineticenergy: 1847.39749426 hartree
xcener: -150.163593898585 hartree
chargesum: -0.0000000
charge: 0.877202 -0.193392 -0.189683 -0.190640 -0.489062 -0.513209 -0.459884 -0.269909 -0.214462 -0.130729 -0.422498 -0.416721 -0.362050 0.121271 -0.109124 -0.146689 -0.162938 -0.195647 -0.078099 0.501436 -0.096496 -0.194673 0.384630 0.407436 0.318796 0.457818 -0.250912 -0.117247 0.108384 0.111258 0.103548 0.119410 0.137183 0.128328 0.164416 0.163440 0.213779 0.193594 0.105086 0.101174 0.117743 0.117637 0.117848 0.132647
qa: 0.8772 -0.1934 -0.1897 -0.1906 -0.4891 -0.5132 -0.4599 -0.2699 -0.2145 -0.1307 -0.4225 -0.4167 -0.3620 0.1213 -0.1091 -0.1467 -0.1629 -0.1956 -0.0781 0.5014 -0.0965 -0.1947 0.3846 0.4074 0.3188 0.4578 -0.2509 -0.1172 0.1084 0.1113 0.1035 0.1194 0.1372 0.1283 0.1644 0.1634 0.2138 0.1936 0.1051 0.1012 0.1177 0.1176 0.1178 0.1326
va: 5.7969 1.1008 1.1079 1.1010 1.9964 1.9714 2.0540 2.1360 3.0735 3.2090 3.0046 2.9581 3.0131 3.5061 3.7551 3.6921 3.8108 3.9795 3.9151 4.4296 3.8852 3.9521 4.3760 4.1911 3.9333 4.2431 3.9327 3.8461 1.0189 1.0347 1.0611 1.0248 1.0034 1.0168 0.9865 0.9894 1.0616 1.0163 1.0056 1.0163 0.9987 0.9950 0.9949 0.9942
dispcorr: -0.022881947 hartree
energy: -1853.911664096086
dipole: -21.47582 19.81654 -1.65928 21.15750 -19.12429 2.03321 -6.81893 4.26582 -2.55312
magnitude: 3.66136 au
magnitude: 9.30643 debye
