program: Gaussian 09
title: 000069099
version: EM64L-G09RevD.01
frameworkgroup: C1[X(C6H9N3)]
method: RPBEPBE
basis: SDD
operation: Freq
keyword: #p
keyword: freq=noraman
keyword: PBEPBE/SDD
title: #p freq=noraman PBEPBE/SDD
converged: NO NO NO NO
title: Mulliken charges:
elementType: N N N C C C C C C H H H H H H H H H
charge: -0.724014 -0.727457 -0.727454 0.137194 0.398249 0.398240 -0.452458 -0.452454 -0.215241 0.202977 0.202978 0.209886 0.287447 0.287447 0.305024 0.282306 0.305024 0.282307
chargesum: 0.00000
title: Mulliken charges with hydrogens summed into heavy atoms:
elementType: N N N C C C C C C
charge: -0.149120 -0.140128 -0.140123 0.137194 0.398249 0.398240 -0.249481 -0.249476 -0.005355
polarizability: 1.13516226e+02 -1.56441324e-04 1.06738776e+02 -9.96702245e-04 8.68738723e-03 3.80559372e+01
1716.lowfreq: -506.2607 -473.5441 -0.0006 -0.0004 0.0007 2.8655 8.4171 8.9126 132.5947
frequency: -506.2607 -473.5399 132.5875 136.6858 142.7615 229.1919 265.8032 312.7439 330.9552 338.4053 368.7426 474.5990 484.0768 531.6086 537.0939 572.9203 680.2208 698.0191 759.2636 811.0100 816.9984 895.4944 911.5327 996.4232 1036.7574 1104.8297 1146.2675 1200.8326 1263.1819 1285.3290 1343.8298 1416.8105 1471.1536 1531.1089 1589.0917 1621.1234 1629.9920 1648.9707 1692.8371 3113.6967 3121.2219 3153.0193 3590.5791 3590.8510 3615.5388 3726.8901 3727.9834 3741.3162
redmass: 1.0232 1.0605 1.4299 1.2248 4.4394 2.6011 1.4274 1.1157 3.1557 1.9792 3.4121 2.4880 6.2648 3.9862 5.6546 4.4825 4.9070 1.6129 2.9491 1.4553 4.7823 1.9457 1.2939 1.7054 1.2818 1.4359 1.3076 1.8340 4.6352 1.5250 2.7916 7.9453 3.2329 4.7310 2.5958 4.0709 1.6364 1.2982 1.1200 1.0849 1.0912 1.0992 1.0454 1.0454 1.0458 1.1032 1.1024 1.1013
irintensity: 0.0036 1.2526 638.1081 0.0063 40.0267 0.0000 290.5666 0.0020 2.6251 12.4673 0.0871 2.2242 0.6347 0.0477 0.5371 0.0000 0.2610 49.1052 68.4457 0.0000 2.3360 6.4716 2.1802 0.2343 6.2128 25.0038 73.3380 45.7848 35.2827 18.6654 51.5179 1.2925 74.6630 158.5790 1.2583 68.0030 3.6346 361.0614 166.0236 0.0959 40.2813 27.5020 0.8205 72.4079 25.0661 10.1375 17.8819 5.1820
temp: 298.150 k
press: 1.00000 atm
elementType: 7 7 7 6 6 6 6 6 6 1 1 1 1 1 1 1 1 1
symmnumber: 1
zpe: 381551.0 jmol-1
zpe.correction: 0.145325 hartree
zpe.thermalcorrener: 0.154471 hartree
zpe.thermalcorrenthalpy: 0.155415 hartree
zpe.thermalcorrgfe: 0.112081 hartree
zpe.sumelectzpe: -397.622639 hartree
zpe.sumelectthermal: -397.613494 hartree
zpe.sumelectthermalent: -397.612550 hartree
zpe.sumelectthermalfe: -397.655883 hartree
dipole: -0.0001 3.2956 0.0022
dipole: 3.2956
quadrupole: -36.3839 -42.5272 -61.9689
quadrupole: 0.0000 0.0011 -0.0063
quadrupole: 10.5761 4.4328 -15.0089 0.0000 0.0011 -0.0063
hfenergy: -397.7679645 hartree
pointgroup: C01 [X(C6H9N3)]
dipole: 0.0001922 -1.2965992 0.0008527 debye
dipolederiv: -0.0844839 0.0001666 0.0001323 0.0001683 -1.3154014 0.0008737 0.0001003 0.0027229 -0.7840178 -1.1726984 -0.4633065 -0.0000684 -0.554638 -0.3512884 -0.0011943 -0.0014377 -0.0015725 -0.7808446 -1.1729617 0.4631088 0.0000384 0.5544331 -0.3510344 -0.0010499 0.0012415 -0.0013748 -0.7808402 -0.6707946 -0.0002614 -0.0000466 -0.000255 1.2372881 0.0001109 -0.0000541 0.0005197 -0.0030431 1.2592131 0.580888 -0.0002288 0.4380814 0.2291127 0.0001936 -0.0004219 -0.0000944 0.1168552 1.2594772 -0.5806232 0.0002396 -0.4378281 0.2288774 0.0001585 0.0004165 -0.0001767 0.1168578 -0.2037187 -0.003421 0.0000145 -0.2330896 -0.1625049 0.0000253 0.0003406 0.0000269 -0.2846532 -0.203783 0.0034209 0.000002 0.2330853 -0.1624601 0.0000275 -0.0002851 0.0000096 -0.2846587 0.2542084 0.0000337 0.0000101 0.0000387 -0.0274741 -0.0000801 0.00002 -0.0000618 -0.1587303 -0.133598 0.1016382 0.0000392 0.0739234 0.0334484 -0.000032 0.0001406 0.0000701 0.177675 -0.1335506 -0.1016825 -0.0000507 -0.0739719 0.0333977 -0.000032 -0.0001621 0.0000725 0.177676 0.0881385 0.0000223 -0.0000018 0.0000296 -0.1562493 0.0000835 -0.0000096 0.0000864 0.1605868 0.0816797 -0.0370707 -0.0003319 -0.011908 0.1883961 -0.0003223 -0.0006951 -0.0014272 0.3889973 0.0816676 0.0370437 0.0002405 0.0118805 0.1884123 -0.0003327 0.0006191 -0.0013388 0.388998 0.1925473 0.0229612 0.0001812 0.0383246 0.1225758 0.0002412 0.0005891 0.000115 0.3869436 0.1830389 0.0338348 -0.0000899 0.0228768 0.0711801 0.0005916 0.0008359 0.0012384 0.387628 0.1925619 -0.0229454 -0.0001617 -0.0383031 0.1225614 0.000213 -0.0005107 0.0000993 0.3869445 0.1830562 -0.0338073 0.000082 -0.0228479 0.0711628 0.0005246 -0.0007273 0.0010855 0.3876256 unknown
polarizability: 113.5162264|0.0006309|106.7387765|0.0009977|-0.0086873|38.0559372 unknown
InChI: InChI=1S/C6H9N3/c7-4-2-1-3-5(8)6(4)9/h1-3H,7-9H2
charge 0 multiplicity 1
18 atoms
N  0.000278 -2.224547 -0.000567
N  -2.46865 -0.760034 0.000501
N  2.468803 -0.759403 0.000524
C  0.000083 -0.805726 -0.00002
C  -1.231595 -0.081842 0.000158
C  1.231583 -0.081522 0.000188
C  -1.222545 1.339407 -0.000165
C  1.222153 1.339721 -0.000109
C  -0.000289 2.041866 -0.000426
H  -2.175037 1.883544 -0.00015
H  2.174495 1.884116 -0.000046
H  -0.000406 3.137392 -0.000685
H  -0.858998 -2.759431 -0.002884
H  0.859698 -2.759204 -0.002585
H  -3.325647 -0.216927 0.000802
H  -2.555926 -1.768783 0.003073
H  3.325671 -0.216094 0.000795
H  2.556329 -1.768131 0.002797
