program: Orca
programVersion: 4.2.1
elementType: S F F F O O O O N N N N N C C C C C C C C C C C C C C C H H H H H H H H H H H H H H H H
charge: 0
multiplicity: 1
keywords: wb97x-d3
keywords: def2-TZVPP
keywords: def2/J RIJCOSX GRIDX6 NOFINALGRIDX
keywords: grid4 nofinalgrid
keywords: scfconv7
keywords: smallprint printgap noloewdin
keywords: NOSOSCF
formula: C15H16F3N5O4S
InChI: InChI=1S/C15H16F3N5O4S/c1-9-19-12(22-14(20-9)27-2)21-13(24)23-28(25,26)11-6-4-3-5-10(11)7-8-15(16,17)18/h3-6,21,23H,7-8H2,1-2H3
44 atoms
S  0.23731 -1.163421 0.542123
F  4.868464 -1.133271 0.573972
F  5.65143 -1.462037 -1.4022
F  5.560317 -3.087264 0.006068
O  0.488957 -2.392922 -0.176193
O  0.006814 -1.216799 1.974404
O  -0.511533 -0.275213 -2.196994
O  -4.4782 0.912299 2.533331
N  -1.164914 -0.457822 -0.031673
N  -2.48215 0.648548 -1.594365
N  -4.411669 1.828544 -1.312888
N  -3.433915 0.737355 0.522604
N  -5.413257 1.966856 0.811112
C  2.468076 -0.041987 -0.768479
C  2.752583 -1.251912 -1.620529
C  1.466298 0.073418 0.20121
C  3.517452 -2.380494 -0.923193
C  3.291667 1.072331 -0.941037
C  1.315839 1.228308 0.969448
C  4.891473 -2.011846 -0.440187
C  3.143034 2.227904 -0.196828
C  2.15396 2.307185 0.772549
C  -1.323429 -0.057733 -1.326558
C  -3.473742 1.080068 -0.758204
C  -5.360907 2.251387 -0.482586
C  -4.428596 1.204779 1.257949
C  -6.452018 3.081645 -1.056821
C  -3.453914 0.092041 3.097042
H  1.833367 -1.675995 -2.014589
H  3.319234 -0.920866 -2.491321
H  2.95795 -2.770535 -0.072789
H  3.626297 -3.205894 -1.630111
H  4.06989 1.02822 -1.692368
H  0.538928 1.299727 1.719369
H  3.802532 3.067365 -0.372806
H  2.030381 3.20126 1.367888
H  -1.893014 -0.200952 0.647103
H  -2.577755 0.940691 -2.559006
H  -7.217172 2.42938 -1.484525
H  -6.925767 3.692688 -0.292299
H  -6.080844 3.716109 -1.859217
H  -3.416685 -0.888174 2.621498
H  -3.720728 -0.031912 4.142733
H  -2.4778 0.574409 3.037208
elementType: S F O N C H
totalener: -1853.88619633 hartree
nucrepener: 2998.70542428 hartree
electener: -4852.59162061 hartree
oneelecener: -8509.35972322 hartree
twoeener: 3656.76810261 hartree
cpcmener: -0.03731833 hartree
kineticenergy: 1847.39934784 hartree
xcener: -150.165253928604 hartree
chargesum: -0.0000000
charge: 0.883338 -0.186610 -0.192940 -0.189841 -0.493988 -0.515224 -0.452227 -0.267774 -0.209468 -0.132834 -0.404580 -0.426534 -0.362982 0.096913 -0.106940 -0.143124 -0.180014 -0.173303 -0.058438 0.511223 -0.091135 -0.208197 0.374556 0.401762 0.318892 0.450701 -0.239555 -0.129453 0.106408 0.109586 0.103517 0.115354 0.134999 0.133579 0.163765 0.162643 0.212852 0.193593 0.115909 0.100017 0.102221 0.120470 0.138608 0.114255
qa: 0.8833 -0.1866 -0.1929 -0.1898 -0.4940 -0.5152 -0.4522 -0.2678 -0.2095 -0.1328 -0.4046 -0.4265 -0.3630 0.0969 -0.1069 -0.1431 -0.1800 -0.1733 -0.0584 0.5112 -0.0911 -0.2082 0.3746 0.4018 0.3189 0.4507 -0.2396 -0.1295 0.1064 0.1096 0.1035 0.1154 0.1350 0.1336 0.1638 0.1626 0.2129 0.1936 0.1159 0.1000 0.1022 0.1205 0.1386 0.1143
va: 5.7961 1.0981 1.1004 1.1076 1.9932 1.9755 2.0653 2.1455 3.0888 3.2112 3.0165 2.9554 3.0045 3.4696 3.7812 3.6722 3.8762 3.9558 3.9087 4.3813 3.8966 3.9808 4.3881 4.2160 3.9649 4.2333 3.9293 3.8546 1.0349 1.0078 1.0379 1.0206 1.0069 1.0066 0.9861 0.9899 1.0605 1.0177 0.9995 1.0140 1.0101 0.9904 0.9975 0.9901
dispcorr: -0.024678872 hartree
energy: -1853.910875203569
dipole: -26.39581 24.95220 -1.44361 15.18707 -13.00131 2.18576 0.30737 -0.73999 -0.43262
magnitude: 2.65494 au
magnitude: 6.74833 debye
