program: Orca
programVersion: 4.2.1
elementType: S F F F O O O O N N N N N C C C C C C C C C C C C C C C H H H H H H H H H H H H H H H H
charge: 0
multiplicity: 1
keywords: wb97x-d3
keywords: def2-TZVPP
keywords: def2/J RIJCOSX GRIDX6 NOFINALGRIDX
keywords: grid4 nofinalgrid
keywords: scfconv7
keywords: smallprint printgap noloewdin
keywords: NOSOSCF
formula: C15H16F3N5O4S
InChI: InChI=1S/C15H16F3N5O4S/c1-9-19-12(22-14(20-9)27-2)21-13(24)23-28(25,26)11-6-4-3-5-10(11)7-8-15(16,17)18/h3-6,21,23H,7-8H2,1-2H3
44 atoms
S  0.297645 -0.955958 0.627615
F  5.467737 -3.253513 -0.085795
F  4.96117 -1.236123 0.455561
F  5.60839 -1.679483 -1.546568
O  0.467101 -2.222076 -0.051479
O  0.101682 -0.947136 2.06618
O  -0.490258 -0.147034 -2.125209
O  -4.540372 0.917194 2.566947
N  -1.081569 -0.199765 0.064204
N  -2.503879 0.691462 -1.543182
N  -4.574071 1.617668 -1.324243
N  -3.465974 0.779003 0.569249
N  -5.603451 1.727124 0.787896
C  2.548258 -0.008634 -0.778438
C  2.722287 -1.248673 -1.61744
C  1.583796 0.196119 0.214523
C  3.438607 -2.414262 -0.929879
C  3.442857 1.041082 -0.995383
C  1.534549 1.373588 0.960867
C  4.86118 -2.141058 -0.530266
C  3.396742 2.217909 -0.271302
C  2.441362 2.386212 0.719999
C  -1.294661 0.086917 -1.251762
C  -3.545799 1.038079 -0.729481
C  -5.580643 1.946582 -0.518894
C  -4.522255 1.141295 1.277011
C  -6.747436 2.633508 -1.132612
C  -3.418963 0.275511 3.175656
H  1.764185 -1.618638 -1.970537
H  3.275869 -0.968363 -2.514213
H  2.898335 -2.740561 -0.041466
H  3.447188 -3.26082 -1.619271
H  4.195293 0.928218 -1.765638
H  0.784544 1.514706 1.727745
H  4.109955 3.004108 -0.480489
H  2.397542 3.298172 1.299201
H  -1.821004 0.029676 0.740081
H  -2.633559 0.910048 -2.523169
H  -6.973456 2.217374 -2.112726
H  -7.624677 2.56903 -0.493977
H  -6.510889 3.690268 -1.277008
H  -3.669109 0.187142 4.228997
H  -2.513136 0.87425 3.076378
H  -3.255736 -0.720928 2.764803
elementType: S F O N C H
totalener: -1853.88687365 hartree
nucrepener: 2986.90213200 hartree
electener: -4840.78900564 hartree
oneelecener: -8485.82468829 hartree
twoeener: 3645.03568264 hartree
cpcmener: -0.03704270 hartree
kineticenergy: 1847.40063954 hartree
xcener: -150.165693939801 hartree
chargesum: 0.0000000
charge: 0.881012 -0.189983 -0.186830 -0.192849 -0.493739 -0.515653 -0.456685 -0.267703 -0.205605 -0.131365 -0.407138 -0.427284 -0.362174 0.098153 -0.101995 -0.141111 -0.181835 -0.174080 -0.065213 0.511034 -0.093625 -0.202443 0.378979 0.400173 0.319528 0.451159 -0.238834 -0.132767 0.105381 0.109215 0.103941 0.115262 0.135097 0.133001 0.163548 0.162879 0.214401 0.192654 0.103974 0.098739 0.115148 0.138597 0.116539 0.120494
qa: 0.8810 -0.1900 -0.1868 -0.1928 -0.4937 -0.5157 -0.4567 -0.2677 -0.2056 -0.1314 -0.4071 -0.4273 -0.3622 0.0982 -0.1020 -0.1411 -0.1818 -0.1741 -0.0652 0.5110 -0.0936 -0.2024 0.3790 0.4002 0.3195 0.4512 -0.2388 -0.1328 0.1054 0.1092 0.1039 0.1153 0.1351 0.1330 0.1635 0.1629 0.2144 0.1927 0.1040 0.0987 0.1151 0.1386 0.1165 0.1205
va: 5.7948 1.1074 1.0983 1.1005 1.9947 1.9732 2.0622 2.1449 3.0959 3.2095 3.0145 2.9550 3.0070 3.4721 3.7801 3.6965 3.8765 3.9529 3.9195 4.3826 3.8974 3.9715 4.3859 4.2183 3.9653 4.2308 3.9290 3.8527 1.0354 1.0080 1.0386 1.0203 1.0070 1.0114 0.9862 0.9896 1.0552 1.0184 1.0085 1.0154 0.9997 0.9978 0.9898 0.9913
dispcorr: -0.024382793 hartree
energy: -1853.911256440951
dipole: -26.39598 25.03619 -1.35979 15.30403 -13.10234 2.20169 0.58180 -1.02729 -0.44548
magnitude: 2.62582 au
magnitude: 6.67430 debye
