program: Orca
programVersion: 4.2.1
elementType: S F F F O O O O N N N N N C C C C C C C C C C C C C C C H H H H H H H H H H H H H H H H
charge: 0
multiplicity: 1
keywords: wb97x-d3
keywords: def2-TZVPP
keywords: def2/J RIJCOSX GRIDX6 NOFINALGRIDX
keywords: grid4 nofinalgrid
keywords: scfconv7
keywords: smallprint printgap noloewdin
keywords: NOSOSCF
formula: C15H16F3N5O4S
InChI: InChI=1S/C15H16F3N5O4S/c1-9-19-12(22-14(20-9)27-2)21-13(24)23-28(25,26)11-6-4-3-5-10(11)7-8-15(16,17)18/h3-6,21,23H,7-8H2,1-2H3
44 atoms
S  1.036116 2.332151 -1.144816
F  2.022598 -4.361374 -0.876788
F  1.475662 -3.014593 -2.465692
F  0.330455 -3.049466 -0.643464
O  0.990309 3.770687 -1.092191
O  0.95404 1.636277 -2.410801
O  0.088224 2.853716 1.659701
O  -5.356353 -1.162727 2.044343
N  -0.250439 1.6935 -0.27336
N  -1.69577 1.478737 1.53994
N  -2.305497 0.012523 -0.160036
N  -3.534962 0.177869 1.838735
N  -4.192632 -1.344442 0.158657
C  2.830327 0.423457 -0.179966
C  2.019574 -0.662975 -0.845447
C  2.457589 1.77637 -0.230358
C  2.485851 -2.080677 -0.539567
C  3.990036 0.128156 0.528542
C  3.190872 2.765805 0.406119
C  1.577846 -3.127015 -1.136643
C  4.739574 1.112439 1.156992
C  4.340811 2.43404 1.102618
C  -0.552428 2.077446 1.003182
C  -2.531887 0.524241 1.039453
C  -3.168042 -0.929866 -0.55437
C  -4.328283 -0.752101 1.342977
C  -2.926095 -1.545379 -1.888471
C  -5.587972 -0.578411 3.317796
H  0.977954 -0.56413 -0.533106
H  2.026764 -0.5001 -1.923084
H  3.490548 -2.255098 -0.931633
H  2.525116 -2.256126 0.538228
H  4.331808 -0.894838 0.60072
H  2.8599 3.792938 0.361832
H  5.637313 0.835311 1.693735
H  4.912806 3.20553 1.598811
H  -0.859374 1.009507 -0.736969
H  -1.921212 1.79824 2.470624
H  -1.979254 -2.086944 -1.878613
H  -3.726029 -2.232265 -2.147571
H  -2.84248 -0.773886 -2.65376
H  -5.754609 0.496171 3.243209
H  -4.756474 -0.756491 3.999675
H  -6.483015 -1.059746 3.701434
totalener: -1853.85767956 hartree
nucrepener: 3014.31665298 hartree
electener: -4868.17433254 hartree
oneelecener: -8539.95940568 hartree
twoeener: 3671.78507313 hartree
kineticenergy: 1847.42896022 hartree
xcener: -150.164474833244 hartree
chargesum: -0.0000000
charge: 0.862898 -0.170654 -0.177831 -0.187563 -0.431362 -0.461963 -0.359997 -0.231557 -0.239316 -0.162796 -0.419019 -0.401383 -0.295246 0.055131 -0.109847 -0.190823 -0.189387 -0.196030 0.030399 0.513036 -0.096967 -0.150250 0.344717 0.381484 0.278131 0.413630 -0.238863 -0.128012 0.078696 0.139554 0.093914 0.094555 0.113826 0.141209 0.132753 0.133245 0.203298 0.171432 0.097869 0.109355 0.102587 0.110700 0.109626 0.126823
qa: 0.8629 -0.1707 -0.1778 -0.1876 -0.4314 -0.4620 -0.3600 -0.2316 -0.2393 -0.1628 -0.4190 -0.4014 -0.2952 0.0551 -0.1098 -0.1908 -0.1894 -0.1960 0.0304 0.5130 -0.0970 -0.1503 0.3447 0.3815 0.2781 0.4136 -0.2389 -0.1280 0.0787 0.1396 0.0939 0.0946 0.1138 0.1412 0.1328 0.1332 0.2033 0.1714 0.0979 0.1094 0.1026 0.1107 0.1096 0.1268
va: 5.8229 1.1362 1.1222 1.1094 2.0801 2.0261 2.1591 2.1659 3.0803 3.1813 2.9892 2.9670 3.0283 3.6925 3.7806 3.9925 3.9508 3.9699 3.8551 4.4196 3.9919 3.9805 4.4025 4.2036 3.9574 4.2648 3.9085 3.8744 1.0302 1.0106 1.0193 1.0199 1.0122 1.0250 0.9988 0.9999 1.0672 1.0335 1.0133 1.0185 1.0050 0.9962 0.9962 0.9945
dispcorr: -0.023355415 hartree
energy: -1853.881034974785
dipole: -4.74489 4.73280 -0.01209 6.57685 -7.45968 -0.88283 10.80781 -9.09019 1.71762
magnitude: 1.93126 au
magnitude: 4.90886 debye
