program: Orca
programVersion: 4.2.1
elementType: S F F F O O O O N N N N N C C C C C C C C C C C C C C C H H H H H H H H H H H H H H H H
charge: 0
multiplicity: 1
keywords: wb97x-d3
keywords: def2-TZVPP
keywords: def2/J RIJCOSX GRIDX6 NOFINALGRIDX
keywords: grid4 nofinalgrid
keywords: scfconv7
keywords: smallprint printgap noloewdin
keywords: NOSOSCF
formula: C15H16F3N5O4S
InChI: InChI=1S/C15H16F3N5O4S/c1-9-19-12(22-14(20-9)27-2)21-13(24)23-28(25,26)11-6-4-3-5-10(11)7-8-15(16,17)18/h3-6,21,23H,7-8H2,1-2H3
44 atoms
S  1.128391 1.503528 1.667353
F  0.352788 -3.0164 -1.275322
F  1.657427 -3.784419 0.253465
F  2.055595 -4.218974 -1.818465
O  1.137956 0.276366 2.437527
O  1.097709 2.781617 2.331231
O  -0.05785 3.279985 -0.457539
O  -3.204802 -1.958568 1.146879
N  -0.235212 1.328155 0.70517
N  -1.941205 2.058959 -0.699284
N  -4.001817 1.190437 -1.112911
N  -2.503478 0.021696 0.274748
N  -4.642998 -0.858402 -0.146614
C  2.80842 0.366711 -0.248763
C  2.046685 -0.930946 -0.129475
C  2.458602 1.509246 0.488343
C  2.492158 -2.025148 -1.09092
C  3.892296 0.494103 -1.10998
C  3.142453 2.707901 0.356527
C  1.639319 -3.264434 -0.980217
C  4.591547 1.685649 -1.240649
C  4.217466 2.797791 -0.511496
C  -0.679028 2.297372 -0.154483
C  -2.838925 1.049358 -0.497813
C  -4.870783 0.207174 -0.898634
C  -3.444228 -0.903456 0.409979
C  -6.193728 0.301683 -1.577885
C  -1.92385 -2.112976 1.745109
H  2.125731 -1.292256 0.895649
H  0.987067 -0.726144 -0.29892
H  2.442378 -1.682942 -2.127331
H  3.526303 -2.318829 -0.896685
H  4.212309 -0.351237 -1.70269
H  2.831002 3.571223 0.925811
H  5.429836 1.737792 -1.92269
H  4.750216 3.732696 -0.615051
H  -0.85226 0.534194 0.901193
H  -2.265165 2.791466 -1.314476
H  -6.128444 -0.162901 -2.56391
H  -6.955197 -0.229613 -1.013009
H  -6.48325 1.339637 -1.721998
H  -1.138964 -2.199355 0.993304
H  -1.975992 -3.038652 2.31041
H  -1.6847 -1.293063 2.423418
totalener: -1853.85686322 hartree
nucrepener: 3039.97272189 hartree
electener: -4893.82958511 hartree
oneelecener: -8590.89385352 hartree
twoeener: 3697.06426841 hartree
kineticenergy: 1847.43082763 hartree
xcener: -150.165090912811 hartree
chargesum: 0.0000000
charge: 0.865860 -0.185360 -0.179254 -0.169721 -0.471953 -0.429789 -0.358581 -0.231273 -0.243798 -0.161593 -0.365830 -0.433436 -0.299802 0.052052 -0.102244 -0.189771 -0.192262 -0.193297 0.029870 0.511244 -0.094029 -0.148700 0.346824 0.382480 0.256766 0.413265 -0.228500 -0.121923 0.139997 0.074142 0.093798 0.096034 0.113540 0.141448 0.132861 0.134071 0.198559 0.174499 0.098450 0.106232 0.101785 0.091731 0.130145 0.115461
qa: 0.8659 -0.1854 -0.1793 -0.1697 -0.4720 -0.4298 -0.3586 -0.2313 -0.2438 -0.1616 -0.3658 -0.4334 -0.2998 0.0521 -0.1022 -0.1898 -0.1923 -0.1933 0.0299 0.5112 -0.0940 -0.1487 0.3468 0.3825 0.2568 0.4133 -0.2285 -0.1219 0.1400 0.0741 0.0938 0.0960 0.1135 0.1414 0.1329 0.1341 0.1986 0.1745 0.0985 0.1062 0.1018 0.0917 0.1301 0.1155
va: 5.8081 1.1098 1.1191 1.1383 2.0090 2.0816 2.1616 2.1777 3.0808 3.1798 3.0208 2.9522 3.0182 3.7203 3.7742 3.9968 3.9685 3.9755 3.8544 4.4221 3.9892 3.9796 4.4013 4.2060 4.0226 4.2542 3.9096 3.8766 1.0087 1.0301 1.0193 1.0190 1.0133 1.0243 0.9989 0.9998 1.0631 1.0332 1.0047 1.0132 1.0119 0.9983 0.9996 0.9958
dispcorr: -0.024360203 hartree
energy: -1853.881223424281
dipole: -4.91550 5.23164 0.31615 10.28888 -10.53819 -0.24931 -2.77253 1.38669 -1.38584
magnitude: 1.44314 au
magnitude: 3.66817 debye
