program: Orca
programVersion: 4.2.1
elementType: S F F F O O O O N N N N N C C C C C C C C C C C C C C C H H H H H H H H H H H H H H H H
charge: 0
multiplicity: 1
keywords: wb97x-d3
keywords: def2-TZVPP
keywords: def2/J RIJCOSX GRIDX6 NOFINALGRIDX
keywords: grid4 nofinalgrid
keywords: scfconv7
keywords: smallprint printgap noloewdin
keywords: NOSOSCF
formula: C15H16F3N5O4S
InChI: InChI=1S/C15H16F3N5O4S/c1-9-19-12(22-14(20-9)27-2)21-13(24)23-28(25,26)11-6-4-3-5-10(11)7-8-15(16,17)18/h3-6,21,23H,7-8H2,1-2H3
44 atoms
S  0.295917 -0.983179 0.719979
F  5.49767 -3.234654 -0.332511
F  5.028269 -1.234433 0.306158
F  5.515487 -1.616958 -1.755322
O  0.512307 -2.255021 0.075986
O  0.03473 -0.918566 2.14357
O  -0.466406 -0.210422 -2.113505
O  -4.562771 0.993563 2.532695
N  -1.074043 -0.249014 0.081106
N  -2.484661 0.622484 -1.548485
N  -4.536958 1.590762 -1.379258
N  -3.46935 0.778678 0.552399
N  -5.588248 1.783216 0.719463
C  2.50957 0.007971 -0.715868
C  2.642966 -1.203861 -1.602391
C  1.581217 0.179075 0.316336
C  3.408284 -2.379517 -0.988092
C  3.403769 1.059216 -0.923916
C  1.571701 1.325624 1.109122
C  4.860585 -2.11203 -0.691123
C  3.393016 2.20654 -0.154733
C  2.476087 2.341249 0.876306
C  -1.264781 0.018414 -1.241939
C  -3.52756 1.006906 -0.755273
C  -5.541998 1.963289 -0.591496
C  -4.52858 1.184378 1.237082
C  -6.690989 2.658272 -1.237208
C  -3.470008 0.334929 3.161226
H  1.666763 -1.566578 -1.908219
H  3.141894 -0.892146 -2.520959
H  2.925307 -2.717005 -0.07161
H  3.362745 -3.217435 -1.687032
H  4.133582 0.963994 -1.717587
H  0.857903 1.423134 1.915264
H  4.107001 2.99393 -0.356297
H  2.464151 3.228086 1.494704
H  -1.820111 -0.00407 0.738389
H  -2.604636 0.827249 -2.530131
H  -7.576441 2.608236 -0.609901
H  -6.43962 3.710415 -1.385438
H  -6.897122 2.234768 -2.217723
H  -3.729372 0.27821 4.214183
H  -2.539598 0.893358 3.0511
H  -3.324639 -0.673376 2.772043
totalener: -1853.85656373 hartree
nucrepener: 2985.52867376 hartree
electener: -4839.38523749 hartree
oneelecener: -8482.64443421 hartree
twoeener: 3643.25919672 hartree
kineticenergy: 1847.44114301 hartree
xcener: -150.164917693309 hartree
chargesum: 0.0000000
charge: 0.864840 -0.176136 -0.174497 -0.187074 -0.444873 -0.473563 -0.391951 -0.230610 -0.218281 -0.157564 -0.367060 -0.432973 -0.297867 0.130753 -0.127638 -0.171444 -0.183960 -0.162031 -0.055539 0.507510 -0.072207 -0.173332 0.360172 0.384754 0.256337 0.410409 -0.227543 -0.132738 0.120705 0.097713 0.104996 0.095994 0.115115 0.116664 0.133280 0.131253 0.197381 0.174211 0.106539 0.098321 0.101653 0.130893 0.104627 0.114759
qa: 0.8648 -0.1761 -0.1745 -0.1871 -0.4449 -0.4736 -0.3920 -0.2306 -0.2183 -0.1576 -0.3671 -0.4330 -0.2979 0.1308 -0.1276 -0.1714 -0.1840 -0.1620 -0.0555 0.5075 -0.0722 -0.1733 0.3602 0.3848 0.2563 0.4104 -0.2275 -0.1327 0.1207 0.0977 0.1050 0.0960 0.1151 0.1167 0.1333 0.1313 0.1974 0.1742 0.1065 0.0983 0.1017 0.1309 0.1046 0.1148
va: 5.8070 1.1268 1.1162 1.1077 2.0438 2.0200 2.1204 2.1743 3.0940 3.1850 3.0187 2.9624 3.0211 3.5195 3.8171 3.8054 3.8881 4.0139 3.9570 4.3837 3.9551 4.0120 4.3721 4.2022 4.0220 4.2548 3.9090 3.8761 1.0330 1.0103 1.0407 1.0243 1.0140 1.0205 0.9969 1.0009 1.0665 1.0334 1.0149 1.0047 1.0101 0.9976 0.9934 0.9941
dispcorr: -0.024367534 hartree
energy: -1853.880931261009
dipole: -26.53941 25.30382 -1.23559 15.37703 -13.76625 1.61078 1.41566 -1.63886 -0.22320
magnitude: 2.04233 au
magnitude: 5.19119 debye
