program: Orca
programVersion: 4.2.1
elementType: S F F F O O O O N N N N N C C C C C C C C C C C C C C C H H H H H H H H H H H H H H H H
charge: 0
multiplicity: 1
keywords: wb97x-d3
keywords: def2-TZVPP
keywords: def2/J RIJCOSX GRIDX6 NOFINALGRIDX
keywords: grid4 nofinalgrid
keywords: scfconv7
keywords: smallprint printgap noloewdin
keywords: NOSOSCF
formula: C15H16F3N5O4S
InChI: InChI=1S/C15H16F3N5O4S/c1-9-19-12(22-14(20-9)27-2)21-13(24)23-28(25,26)11-6-4-3-5-10(11)7-8-15(16,17)18/h3-6,21,23H,7-8H2,1-2H3
44 atoms
S  1.242495 1.459566 -1.606914
F  -0.215446 -1.850538 0.835792
F  1.057093 -0.563691 2.002113
F  0.741309 -2.605181 2.61096
O  1.178422 2.854414 -1.964731
O  1.231588 0.442177 -2.640822
O  0.231167 2.603063 0.973916
O  -3.276912 -1.788643 -1.89703
N  -0.0764 1.047834 -0.660609
N  -1.635516 1.337521 1.043491
N  -3.588808 0.256956 1.475152
N  -2.406128 -0.222096 -0.500099
N  -4.420189 -1.343825 -0.038167
C  3.066633 -0.037081 -0.101434
C  2.427245 -1.358831 -0.465771
C  2.626098 1.224993 -0.511851
C  2.106923 -2.261325 0.727894
C  4.217158 -0.070601 0.683507
C  3.276816 2.389065 -0.11834
C  0.924128 -1.813702 1.547364
C  4.880096 1.07987 1.071577
C  4.403443 2.318774 0.678283
C  -0.428657 1.734559 0.469878
C  -2.566777 0.421102 0.651318
C  -4.488317 -0.638946 1.080508
C  -3.35815 -1.095573 -0.786582
C  -5.647695 -0.880994 1.985113
C  -2.158891 -1.587476 -2.75016
H  1.541604 -1.235265 -1.080626
H  3.133026 -1.899984 -1.10117
H  1.890845 -3.268403 0.364664
H  2.963816 -2.356056 1.396393
H  4.613288 -1.028728 0.997449
H  2.896646 3.349313 -0.432978
H  5.769962 1.005257 1.682449
H  4.903847 3.226657 0.984922
H  -0.741306 0.370339 -1.044105
H  -1.845254 1.803636 1.914357
H  -6.450361 -1.389957 1.459352
H  -5.33106 -1.509974 2.819208
H  -6.00769 0.05478 2.407963
H  -2.313332 -2.250055 -3.596776
H  -1.221481 -1.849208 -2.256907
H  -2.096292 -0.558661 -3.106305
totalener: -1853.85382725 hartree
nucrepener: 3175.16017304 hartree
electener: -5029.01400029 hartree
oneelecener: -8861.96482840 hartree
twoeener: 3832.95082812 hartree
kineticenergy: 1847.44166483 hartree
xcener: -150.165659670202 hartree
chargesum: -0.0000000
charge: 0.864250 -0.188994 -0.171703 -0.171429 -0.433995 -0.477407 -0.359698 -0.233442 -0.222440 -0.143049 -0.366380 -0.427911 -0.298991 0.026164 -0.096207 -0.153881 -0.173802 -0.176846 0.037642 0.502010 -0.098805 -0.150652 0.317663 0.379879 0.258655 0.410757 -0.230688 -0.126571 0.064779 0.116172 0.106538 0.090104 0.110638 0.137892 0.131781 0.133348 0.197788 0.172879 0.104726 0.098385 0.100364 0.129563 0.095978 0.114935
qa: 0.8643 -0.1890 -0.1717 -0.1714 -0.4340 -0.4774 -0.3597 -0.2334 -0.2224 -0.1430 -0.3664 -0.4279 -0.2990 0.0262 -0.0962 -0.1539 -0.1738 -0.1768 0.0376 0.5020 -0.0988 -0.1507 0.3177 0.3799 0.2587 0.4108 -0.2307 -0.1266 0.0648 0.1162 0.1065 0.0901 0.1106 0.1379 0.1318 0.1333 0.1978 0.1729 0.1047 0.0984 0.1004 0.1296 0.0960 0.1149
va: 5.8111 1.1017 1.1198 1.1372 2.0786 2.0002 2.1583 2.1690 3.0701 3.1756 3.0207 2.9383 3.0252 3.6802 3.7898 3.9104 3.9163 4.0204 3.8474 4.3673 3.9720 3.9784 4.4047 4.1999 4.0229 4.2553 3.9111 3.8858 1.0682 1.0033 1.0234 1.0256 1.0089 1.0257 0.9983 0.9997 1.0636 1.0341 1.0158 1.0045 1.0095 0.9973 0.9933 0.9937
dispcorr: -0.026975020 hartree
energy: -1853.880802266269
dipole: -0.06758 0.69847 0.63090 -2.91589 1.52212 -1.39377 -4.73538 5.43242 0.69704
magnitude: 1.68122 au
magnitude: 4.27332 debye
