program: Orca
programVersion: 4.2.1
elementType: S F F F O O O O N N N N N C C C C C C C C C C C C C C C H H H H H H H H H H H H H H H H
charge: 0
multiplicity: 1
keywords: wb97x-d3
keywords: def2-TZVPP
keywords: def2/J RIJCOSX GRIDX6 NOFINALGRIDX
keywords: grid4 nofinalgrid
keywords: scfconv7
keywords: smallprint printgap noloewdin
keywords: NOSOSCF
formula: C15H16F3N5O4S
InChI: InChI=1S/C15H16F3N5O4S/c1-9-19-12(22-14(20-9)27-2)21-13(24)23-28(25,26)11-6-4-3-5-10(11)7-8-15(16,17)18/h3-6,21,23H,7-8H2,1-2H3
44 atoms
S  1.184795 1.725724 -1.361619
F  1.12345 -0.894626 1.81513
F  0.82378 -3.011626 2.073364
F  -0.187124 -1.967072 0.485051
O  1.109103 3.161798 -1.460083
O  1.133272 0.910821 -2.560704
O  0.26829 2.386537 1.416452
O  -3.346104 -1.435728 -2.068422
N  -0.098517 1.144262 -0.456396
N  -1.599341 1.123912 1.323477
N  -3.543873 -0.017242 1.619897
N  -2.42596 -0.1391 -0.445267
N  -4.429002 -1.327446 -0.124926
C  3.067203 -0.005379 -0.222632
C  2.414777 -1.2456 -0.792412
C  2.609862 1.306589 -0.380548
C  2.130524 -2.342819 0.235961
C  4.248286 -0.171743 0.497407
C  3.275876 2.385252 0.190778
C  0.974266 -2.048278 1.15638
C  4.926165 0.894632 1.060348
C  4.433664 2.18055 0.916412
C  -0.410806 1.619057 0.78913
C  -2.547257 0.290714 0.805796
C  -4.459103 -0.830455 1.102109
C  -3.390036 -0.94987 -0.850983
C  -5.590788 -1.230997 1.985221
C  -2.254721 -1.0839 -2.907196
H  1.511354 -1.020843 -1.349917
H  3.100334 -1.665307 -1.533103
H  1.902876 -3.273062 -0.289085
H  3.007667 -2.547168 0.851774
H  4.656417 -1.168161 0.616797
H  2.883866 3.383877 0.069794
H  5.840125 0.717762 1.611681
H  4.946106 3.021926 1.361566
H  -0.776608 0.541149 -0.930419
H  -1.778732 1.429195 2.269165
H  -5.903081 -0.399502 2.61338
H  -6.428892 -1.597324 1.399193
H  -5.264386 -2.033341 2.649843
H  -1.303011 -1.424868 -2.496849
H  -2.200859 -0.008241 -3.078384
H  -2.436815 -1.587804 -3.851954
totalener: -1853.85394277 hartree
nucrepener: 3175.60861792 hartree
electener: -5029.46256068 hartree
oneelecener: -8862.86600688 hartree
twoeener: 3833.40344620 hartree
kineticenergy: 1847.44036814 hartree
xcener: -150.165547665361 hartree
chargesum: 0.0000000
charge: 0.864609 -0.171429 -0.171612 -0.188844 -0.434066 -0.477331 -0.359162 -0.233437 -0.222599 -0.141445 -0.365296 -0.427686 -0.298904 0.028383 -0.099868 -0.154816 -0.170965 -0.179162 0.038675 0.500779 -0.099503 -0.149325 0.315736 0.380065 0.257693 0.409874 -0.231861 -0.126541 0.066136 0.116500 0.106334 0.089976 0.110142 0.138351 0.131684 0.132942 0.197974 0.172837 0.101200 0.105162 0.098409 0.095636 0.115325 0.129434
qa: 0.8646 -0.1714 -0.1716 -0.1888 -0.4341 -0.4773 -0.3592 -0.2334 -0.2226 -0.1414 -0.3653 -0.4277 -0.2989 0.0284 -0.0999 -0.1548 -0.1710 -0.1792 0.0387 0.5008 -0.0995 -0.1493 0.3157 0.3801 0.2577 0.4099 -0.2319 -0.1265 0.0661 0.1165 0.1063 0.0900 0.1101 0.1384 0.1317 0.1329 0.1980 0.1728 0.1012 0.1052 0.0984 0.0956 0.1153 0.1294
va: 5.8120 1.1200 1.1370 1.1017 2.0784 1.9998 2.1588 2.1689 3.0683 3.1756 3.0212 2.9370 3.0239 3.6775 3.7917 3.9087 3.9126 4.0217 3.8462 4.3689 3.9722 3.9778 4.4057 4.1994 4.0239 4.2571 3.9114 3.8858 1.0682 1.0035 1.0237 1.0256 1.0089 1.0257 0.9982 0.9999 1.0642 1.0342 1.0102 1.0152 1.0042 0.9935 0.9936 0.9976
dispcorr: -0.026991580 hartree
energy: -1853.880934348955
dipole: -0.20258 0.86419 0.66161 -2.05888 0.56200 -1.49688 -5.16365 5.57863 0.41498
magnitude: 1.68837 au
magnitude: 4.29149 debye
