program: Orca
programVersion: 4.2.1
elementType: S F F F O O O O N N N N N C C C C C C C C C C C C C C C H H H H H H H H H H H H H H H H
charge: 0
multiplicity: 1
keywords: wb97x-d3
keywords: def2-TZVPP
keywords: def2/J RIJCOSX GRIDX6 NOFINALGRIDX
keywords: grid4 nofinalgrid
keywords: scfconv7
keywords: smallprint printgap noloewdin
keywords: NOSOSCF
formula: C15H16F3N5O4S
InChI: InChI=1S/C15H16F3N5O4S/c1-9-19-12(22-14(20-9)27-2)21-13(24)23-28(25,26)11-6-4-3-5-10(11)7-8-15(16,17)18/h3-6,21,23H,7-8H2,1-2H3
44 atoms
S  1.099865 2.397971 -0.899702
F  1.763204 -3.4297 -1.587714
F  -0.021536 -2.227234 -1.603078
F  0.424721 -3.467138 0.100529
O  0.929136 3.772189 -0.500714
O  0.966695 2.016425 -2.289547
O  0.464077 2.06817 2.003013
O  -5.023506 -1.899883 1.809571
N  -0.040994 1.434056 -0.126029
N  -1.308818 0.710182 1.690943
N  -2.236111 -0.069189 -0.296125
N  -3.167078 -0.591583 1.800421
N  -4.161902 -1.404402 -0.179289
C  3.120683 0.516679 -0.486226
C  2.363976 -0.576535 -1.196732
C  2.643096 1.807091 -0.238561
C  1.73339 -1.532013 -0.180675
C  4.378349 0.202358 0.021579
C  3.379329 2.728086 0.496036
C  0.97553 -2.666042 -0.819702
C  5.126587 1.114539 0.745612
C  4.623833 2.381591 0.989598
C  -0.23482 1.472069 1.227218
C  -2.263544 -0.004299 1.024435
C  -3.218833 -0.784248 -0.854539
C  -4.08323 -1.276543 1.14302
C  -3.23128 -0.869711 -2.3408
C  -5.021307 -1.815921 3.227245
H  1.611636 -0.175396 -1.869393
H  3.069671 -1.125004 -1.823725
H  2.502246 -1.960738 0.466043
H  1.046906 -0.990985 0.471523
H  4.780076 -0.78686 -0.164802
H  2.975919 3.711977 0.684411
H  6.102413 0.833413 1.11881
H  5.194673 3.100405 1.560842
H  -0.725098 0.933658 -0.706576
H  -1.415232 0.729844 2.694755
H  -2.334166 -1.379183 -2.691864
H  -4.107038 -1.409368 -2.687671
H  -3.220259 0.128892 -2.777512
H  -4.108342 -2.231888 3.653581
H  -5.875846 -2.40062 3.555428
H  -5.129627 -0.786572 3.569446
totalener: -1853.85810418 hartree
nucrepener: 3080.31115192 hartree
electener: -4934.16925610 hartree
oneelecener: -8671.92720022 hartree
twoeener: 3737.75794412 hartree
kineticenergy: 1847.44170575 hartree
xcener: -150.163300283988 hartree
chargesum: 0.0000000
charge: 0.860956 -0.175888 -0.183556 -0.179331 -0.434051 -0.460229 -0.354403 -0.231404 -0.245665 -0.162985 -0.410647 -0.401902 -0.292366 0.075898 -0.166014 -0.177037 -0.190228 -0.201246 0.021786 0.518777 -0.091653 -0.151362 0.324610 0.378263 0.276856 0.415802 -0.245035 -0.128018 0.125474 0.111104 0.110070 0.088191 0.121375 0.142452 0.134291 0.133569 0.208123 0.172344 0.105723 0.109063 0.101507 0.109802 0.126617 0.110370
qa: 0.8610 -0.1759 -0.1836 -0.1793 -0.4341 -0.4602 -0.3544 -0.2314 -0.2457 -0.1630 -0.4106 -0.4019 -0.2924 0.0759 -0.1660 -0.1770 -0.1902 -0.2012 0.0218 0.5188 -0.0917 -0.1514 0.3246 0.3783 0.2769 0.4158 -0.2450 -0.1280 0.1255 0.1111 0.1101 0.0882 0.1214 0.1425 0.1343 0.1336 0.2081 0.1723 0.1057 0.1091 0.1015 0.1098 0.1266 0.1104
va: 5.8132 1.1272 1.1081 1.1234 2.0786 2.0219 2.1631 2.1678 3.0615 3.1657 2.9756 2.9710 3.0307 3.5833 3.7307 3.9340 3.8716 4.0269 3.8446 4.3883 3.9675 3.9803 4.4021 4.2018 3.9554 4.2633 3.9103 3.8749 1.0587 1.0220 1.0318 1.0436 1.0060 1.0230 0.9974 0.9999 1.0645 1.0332 1.0092 1.0180 1.0042 0.9963 0.9949 0.9960
dispcorr: -0.025288788 hartree
energy: -1853.883392971640
dipole: -1.93709 2.10097 0.16388 4.76846 -5.86477 -1.09631 7.44153 -6.07713 1.36440
magnitude: 1.75794 au
magnitude: 4.46832 debye
