program: Orca
programVersion: 4.2.1
elementType: S F F F O O O O N N N N N C C C C C C C C C C C C C C C H H H H H H H H H H H H H H H H
charge: 0
multiplicity: 1
keywords: wb97x-d3
keywords: def2-TZVPP
keywords: def2/J RIJCOSX GRIDX6 NOFINALGRIDX
keywords: grid4 nofinalgrid
keywords: scfconv7
keywords: smallprint printgap noloewdin
keywords: NOSOSCF
formula: C15H16F3N5O4S
InChI: InChI=1S/C15H16F3N5O4S/c1-9-19-12(22-14(20-9)27-2)21-13(24)23-28(25,26)11-6-4-3-5-10(11)7-8-15(16,17)18/h3-6,21,23H,7-8H2,1-2H3
44 atoms
S  1.233558 1.54333 1.695141
F  0.171211 -2.629796 -2.510237
F  -0.127249 -2.573958 -0.37889
F  1.603125 -3.560002 -1.196232
O  1.252752 0.431392 2.624785
O  1.080721 2.892623 2.178956
O  0.1949 2.881345 -0.791637
O  -3.1917 -1.788994 1.76285
N  -0.039258 1.152796 0.674593
N  -1.639364 1.574328 -0.960546
N  -3.63998 0.575389 -1.377749
N  -2.344424 -0.135599 0.451782
N  -4.41892 -1.153562 0.017862
C  3.083411 0.303374 0.01502
C  2.345395 -1.011012 0.031281
C  2.653355 1.484313 0.627342
C  1.574462 -1.199232 -1.278152
C  4.260942 0.370326 -0.724324
C  3.354388 2.675525 0.487612
C  0.806374 -2.493639 -1.34074
C  4.975553 1.548102 -0.860953
C  4.518005 2.708146 -0.258887
C  -0.435588 1.951258 -0.36569
C  -2.568145 0.634139 -0.607357
C  -4.53544 -0.342542 -1.020601
C  -3.307998 -1.004599 0.721943
C  -5.772542 -0.43909 -1.845435
C  -2.036536 -1.682909 2.585835
H  3.07932 -1.811704 0.14037
H  1.682628 -1.091893 0.887898
H  0.870327 -0.379273 -1.425695
H  2.261097 -1.172946 -2.127219
H  4.627058 -0.531905 -1.200456
H  2.987213 3.575159 0.959069
H  5.889602 1.557677 -1.43965
H  5.061614 3.636439 -0.366323
H  -0.687248 0.425531 0.996157
H  -1.89877 2.141014 -1.755367
H  -6.428675 0.402669 -1.616419
H  -5.53259 -0.377745 -2.905237
H  -6.308433 -1.359903 -1.634698
H  -1.127646 -1.933134 2.039471
H  -2.181728 -2.402756 3.385787
H  -1.93264 -0.68577 3.015072
totalener: -1853.85729372 hartree
nucrepener: 3112.75713688 hartree
electener: -4966.61443061 hartree
oneelecener: -8736.47954686 hartree
twoeener: 3769.86511625 hartree
kineticenergy: 1847.44203447 hartree
xcener: -150.163695939047 hartree
chargesum: 0.0000000
charge: 0.861988 -0.175200 -0.183245 -0.175316 -0.469744 -0.433545 -0.349020 -0.229249 -0.240462 -0.158711 -0.369167 -0.423465 -0.294860 0.072366 -0.145962 -0.173066 -0.191974 -0.200976 0.017911 0.511862 -0.089638 -0.150299 0.310062 0.376018 0.261608 0.414948 -0.229230 -0.128498 0.112352 0.107516 0.097547 0.110413 0.121487 0.142351 0.134521 0.134503 0.200168 0.175060 0.097898 0.100736 0.105945 0.101891 0.130388 0.112089
qa: 0.8620 -0.1752 -0.1832 -0.1753 -0.4697 -0.4335 -0.3490 -0.2292 -0.2405 -0.1587 -0.3692 -0.4235 -0.2949 0.0724 -0.1460 -0.1731 -0.1920 -0.2010 0.0179 0.5119 -0.0896 -0.1503 0.3101 0.3760 0.2616 0.4149 -0.2292 -0.1285 0.1124 0.1075 0.0975 0.1104 0.1215 0.1424 0.1345 0.1345 0.2002 0.1751 0.0979 0.1007 0.1059 0.1019 0.1304 0.1121
va: 5.8059 1.1297 1.1035 1.1268 2.0067 2.0786 2.1673 2.1781 3.0578 3.1618 3.0221 2.9412 3.0267 3.5926 3.7429 3.9271 3.8695 4.0307 3.8499 4.3965 3.9675 3.9799 4.4105 4.2090 4.0176 4.2492 3.9108 3.8788 1.0232 1.0578 1.0389 1.0313 1.0061 1.0219 0.9975 0.9997 1.0668 1.0327 1.0046 1.0086 1.0161 0.9936 0.9980 0.9942
dispcorr: -0.026299321 hartree
energy: -1853.883593045242
dipole: -1.25375 1.65028 0.39653 7.44330 -7.74790 -0.30460 0.85973 -1.89785 -1.03812
magnitude: 1.15226 au
magnitude: 2.92882 debye
