program: Orca
programVersion: 4.2.1
elementType: S F F F O O O O N N N N N C C C C C C C C C C C C C C C H H H H H H H H H H H H H H H H
charge: 0
multiplicity: 1
keywords: wb97x-d3
keywords: def2-TZVPP
keywords: def2/J RIJCOSX GRIDX6 NOFINALGRIDX
keywords: grid4 nofinalgrid
keywords: scfconv7
keywords: smallprint printgap noloewdin
keywords: NOSOSCF
formula: C15H16F3N5O4S
InChI: InChI=1S/C15H16F3N5O4S/c1-9-19-12(22-14(20-9)27-2)21-13(24)23-28(25,26)11-6-4-3-5-10(11)7-8-15(16,17)18/h3-6,21,23H,7-8H2,1-2H3
44 atoms
S  1.185553 1.712072 -1.450596
F  1.641305 -3.705717 0.66573
F  -0.100626 -2.570101 0.10688
F  0.303218 -2.96543 2.183931
O  0.99088 3.111369 -1.738522
O  1.189985 0.738948 -2.525223
O  0.199249 2.67555 1.228345
O  -3.220533 -1.572069 -1.934777
N  -0.043386 1.155823 -0.452133
N  -1.638275 1.361513 1.230206
N  -3.652616 0.337912 1.503479
N  -2.359553 -0.128479 -0.40417
N  -4.449905 -1.166711 -0.123281
C  3.119362 0.297478 -0.02214
C  2.398796 -1.016076 -0.18586
C  2.646341 1.540556 -0.452789
C  1.679914 -1.385906 1.114735
C  4.324989 0.288791 0.673385
C  3.335182 2.716253 -0.182726
C  0.882626 -2.660121 1.01762
C  5.027373 1.451992 0.93839
C  4.528469 2.67232 0.515019
C  -0.435211 1.810977 0.686289
C  -2.577513 0.489814 0.751087
C  -4.559477 -0.507831 1.018202
C  -3.332393 -0.938041 -0.795557
C  -5.795882 -0.707894 1.825615
C  -2.056605 -1.371107 -2.727781
H  1.705901 -0.99432 -1.021838
H  3.137327 -1.783627 -0.42444
H  2.402926 -1.499535 1.925543
H  1.003136 -0.585254 1.415443
H  4.722911 -0.661327 1.010527
H  2.936235 3.663254 -0.515025
H  5.964209 1.402907 1.47724
H  5.062876 3.588638 0.723685
H  -0.695362 0.478327 -0.862774
H  -1.890957 1.81507 2.096559
H  -6.411958 -1.495838 1.403144
H  -5.540198 -0.950315 2.856336
H  -6.372174 0.217996 1.851767
H  -1.157491 -1.713678 -2.216711
H  -1.930681 -0.325339 -3.010239
H  -2.207418 -1.967344 -3.622687
totalener: -1853.85735726 hartree
nucrepener: 3111.28587713 hartree
electener: -4965.14323439 hartree
oneelecener: -8733.57380454 hartree
twoeener: 3768.43057015 hartree
kineticenergy: 1847.44031472 hartree
xcener: -150.163191616034 hartree
chargesum: 0.0000000
charge: 0.861926 -0.175347 -0.183356 -0.174964 -0.434102 -0.470012 -0.348773 -0.229449 -0.240242 -0.156448 -0.371246 -0.422272 -0.293899 0.069433 -0.146234 -0.167191 -0.192427 -0.197305 0.012946 0.510349 -0.091390 -0.149090 0.306248 0.374719 0.261178 0.416285 -0.226757 -0.129301 0.106294 0.112359 0.110852 0.101395 0.121019 0.143014 0.134433 0.134877 0.198879 0.175309 0.106704 0.099044 0.097398 0.103072 0.112157 0.129916
qa: 0.8619 -0.1753 -0.1834 -0.1750 -0.4341 -0.4700 -0.3488 -0.2294 -0.2402 -0.1564 -0.3712 -0.4223 -0.2939 0.0694 -0.1462 -0.1672 -0.1924 -0.1973 0.0129 0.5103 -0.0914 -0.1491 0.3062 0.3747 0.2612 0.4163 -0.2268 -0.1293 0.1063 0.1124 0.1109 0.1014 0.1210 0.1430 0.1344 0.1349 0.1989 0.1753 0.1067 0.0990 0.0974 0.1031 0.1122 0.1299
va: 5.8037 1.1264 1.1032 1.1304 2.0780 2.0052 2.1669 2.1778 3.0542 3.1607 3.0208 2.9420 3.0293 3.5991 3.7457 3.9274 3.8701 4.0281 3.8557 4.3993 3.9709 3.9792 4.4136 4.2111 4.0181 4.2447 3.9082 3.8786 1.0593 1.0223 1.0309 1.0350 1.0061 1.0217 0.9976 0.9996 1.0689 1.0324 1.0170 1.0074 1.0055 0.9940 0.9948 0.9981
dispcorr: -0.026248843 hartree
energy: -1853.883606098940
dipole: -1.15438 1.63343 0.47906 7.48802 -7.92886 -0.44084 -0.09853 1.06439 0.96587
magnitude: 1.16479 au
magnitude: 2.96066 debye
