program: Orca
programVersion: 4.2.1
elementType: S F F F O O O O N N N N N C C C C C C C C C C C C C C C H H H H H H H H H H H H H H H H
charge: 0
multiplicity: 1
keywords: wb97x-d3
keywords: def2-TZVPP
keywords: def2/J RIJCOSX GRIDX6 NOFINALGRIDX
keywords: grid4 nofinalgrid
keywords: scfconv7
keywords: smallprint printgap noloewdin
keywords: NOSOSCF
formula: C15H16F3N5O4S
InChI: InChI=1S/C15H16F3N5O4S/c1-9-19-12(22-14(20-9)27-2)21-13(24)23-28(25,26)11-6-4-3-5-10(11)7-8-15(16,17)18/h3-6,21,23H,7-8H2,1-2H3
44 atoms
S  1.16429 1.797714 -1.422939
F  -0.126857 -2.574836 -0.035053
F  0.271645 -3.020898 2.032636
F  1.61895 -3.715301 0.50102
O  0.985537 3.209591 -1.652361
O  1.142347 0.868272 -2.535086
O  0.228825 2.661541 1.307686
O  -3.245928 -1.488299 -1.924848
N  -0.058986 1.217654 -0.431412
N  -1.602404 1.338496 1.30534
N  -3.589556 0.269209 1.603813
N  -2.35744 -0.092388 -0.365957
N  -4.416971 -1.181864 -0.056183
C  3.095298 0.301909 -0.073974
C  2.356607 -0.995272 -0.281976
C  2.634549 1.567065 -0.450233
C  1.64449 -1.4078 1.009351
C  4.308097 0.250392 0.607258
C  3.341787 2.722201 -0.141451
C  0.853549 -2.682875 0.876581
C  5.028669 1.392996 0.910075
C  4.54149 2.635513 0.54098
C  -0.418551 1.819256 0.746003
C  -2.543565 0.471156 0.822041
C  -4.497698 -0.572822 1.115427
C  -3.328923 -0.904387 -0.756724
C  -5.685351 -0.858923 1.968611
C  -2.116186 -1.229339 -2.749902
H  1.65636 -0.932348 -1.109786
H  3.083423 -1.7616 -0.557861
H  2.370493 -1.541931 1.814349
H  0.964612 -0.619988 1.335613
H  4.696885 -0.717329 0.902487
H  2.951204 3.686475 -0.431283
H  5.970433 1.31043 1.436118
H  5.090264 3.535862 0.77969
H  -0.719939 0.555832 -0.853176
H  -1.832248 1.751554 2.197896
H  -6.47401 -1.329797 1.389106
H  -5.399305 -1.535952 2.775633
H  -6.053386 0.054277 2.432402
H  -2.287971 -1.79058 -3.663458
H  -1.191992 -1.573519 -2.286954
H  -2.021959 -0.170118 -2.991592
totalener: -1853.85733432 hartree
nucrepener: 3115.05877918 hartree
electener: -4968.91611350 hartree
oneelecener: -8741.09073343 hartree
twoeener: 3772.17461993 hartree
kineticenergy: 1847.44125088 hartree
xcener: -150.163621244115 hartree
chargesum: -0.0000000
charge: 0.861985 -0.183405 -0.175554 -0.175259 -0.433779 -0.469814 -0.348508 -0.229361 -0.240872 -0.157061 -0.368851 -0.423275 -0.294275 0.070856 -0.145895 -0.167820 -0.192952 -0.199716 0.012699 0.511772 -0.090586 -0.149429 0.307705 0.375973 0.259678 0.414734 -0.228807 -0.128947 0.106619 0.112681 0.111141 0.099772 0.121048 0.143222 0.134434 0.134905 0.199387 0.175414 0.106228 0.098663 0.100294 0.129973 0.102887 0.112096
qa: 0.8620 -0.1834 -0.1756 -0.1753 -0.4338 -0.4698 -0.3485 -0.2294 -0.2409 -0.1571 -0.3689 -0.4233 -0.2943 0.0709 -0.1459 -0.1678 -0.1930 -0.1997 0.0127 0.5118 -0.0906 -0.1494 0.3077 0.3760 0.2597 0.4147 -0.2288 -0.1289 0.1066 0.1127 0.1111 0.0998 0.1210 0.1432 0.1344 0.1349 0.1994 0.1754 0.1062 0.0987 0.1003 0.1300 0.1029 0.1121
va: 5.8055 1.1030 1.1296 1.1270 2.0783 2.0061 2.1677 2.1779 3.0544 3.1623 3.0213 2.9398 3.0270 3.5962 3.7451 3.9261 3.8714 4.0292 3.8551 4.3964 3.9695 3.9801 4.4128 4.2080 4.0209 4.2488 3.9093 3.8785 1.0584 1.0227 1.0311 1.0367 1.0060 1.0216 0.9975 0.9996 1.0690 1.0324 1.0161 1.0047 1.0088 0.9982 0.9935 0.9945
dispcorr: -0.026370939 hartree
energy: -1853.883705257676
dipole: -0.98377 1.47284 0.48907 7.19399 -7.71080 -0.51681 0.44282 0.51570 0.95852
magnitude: 1.19375 au
magnitude: 3.03427 debye
