program: Orca
programVersion: 4.2.1
elementType: Cl S O O O O O N N N N N N C C C C C C C C C C C C C C H H H H H H H H H H H H H
charge: 0
multiplicity: 1
keywords: wb97x-d3
keywords: def2-TZVPP
keywords: def2/J RIJCOSX GRIDX6 NOFINALGRIDX
keywords: grid4 nofinalgrid
keywords: scfconv7
keywords: smallprint printgap noloewdin
keywords: NOSOSCF
formula: C14H13ClN6O5S
InChI: InChI=1S/C14H13ClN6O5S/c1-25-9-7-10(26-2)18-13(17-9)19-14(22)20-27(23,24)12-11(15)16-8-5-3-4-6-21(8)12/h3-7,19-20H,1-2H3
40 atoms
Cl 3.643254 2.753412 -0.39485
S  1.271809 0.76424 1.31164
O  1.144359 -0.136904 2.44298
O  1.353925 2.189027 1.530757
O  0.516829 1.71121 -1.376741
O  -6.084929 0.133865 -1.475661
O  -3.619114 -1.432519 2.131129
N  2.974743 -1.008179 0.081011
N  4.449528 0.316485 -0.959554
N  -0.055653 0.391024 0.380543
N  -1.596287 0.918869 -1.278752
N  -3.833324 0.521687 -1.388812
N  -2.587171 -0.28217 0.446425
C  2.624042 0.302629 0.354008
C  4.095708 -0.944769 -0.715697
C  3.560218 1.062923 -0.323449
C  2.416222 -2.195057 0.452555
C  4.699167 -2.132554 -1.148142
C  2.991599 -3.350742 0.031476
C  4.14942 -3.32499 -0.773951
C  -0.319762 1.057506 -0.791428
C  -2.717548 0.355794 -0.704092
C  -4.927759 0.002214 -0.849783
C  -3.6942 -0.793841 0.976133
C  -4.927886 -0.68182 0.360226
C  -6.129096 0.842456 -2.712468
C  -2.352302 -1.549245 2.775611
H  1.537378 -2.173406 1.074908
H  5.582557 -2.071714 -1.766756
H  -0.849387 -0.089989 0.83272
H  2.546446 -4.288224 0.328647
H  4.59775 -4.254507 -1.094712
H  -1.757515 1.392152 -2.158013
H  -5.827586 -1.097268 0.789531
H  -5.807598 1.876853 -2.596047
H  -7.170323 0.825322 -3.021648
H  -5.52127 0.358863 -3.476212
H  -1.946636 -0.573493 3.044413
H  -1.63656 -2.096303 2.161415
H  -2.536449 -2.113492 3.685317
elementType: Cl S O N C H
totalener: -2104.52425349 hartree
nucrepener: 2922.46176527 hartree
electener: -5026.98601876 hartree
oneelecener: -8699.11874460 hartree
twoeener: 3672.13272585 hartree
cpcmener: -0.04892807 hartree
kineticenergy: 2098.05114363 hartree
xcener: -155.311457623882 hartree
chargesum: -0.0000000
charge: -0.019284 0.852734 -0.513425 -0.489331 -0.474719 -0.300115 -0.298310 0.042041 -0.331923 -0.225658 -0.135719 -0.425437 -0.430413 -0.174315 0.230657 0.172077 0.028355 -0.197932 -0.199186 -0.099300 0.393101 0.373742 0.422488 0.429580 -0.326185 -0.114814 -0.125846 0.155819 0.156655 0.211594 0.171423 0.173474 0.191993 0.147350 0.114273 0.132935 0.114700 0.112674 0.114181 0.140062
qa: -0.0193 0.8527 -0.5134 -0.4893 -0.4747 -0.3001 -0.2983 0.0420 -0.3319 -0.2257 -0.1357 -0.4254 -0.4304 -0.1743 0.2307 0.1721 0.0284 -0.1979 -0.1992 -0.0993 0.3931 0.3737 0.4225 0.4296 -0.3262 -0.1148 -0.1258 0.1558 0.1567 0.2116 0.1714 0.1735 0.1920 0.1473 0.1143 0.1329 0.1147 0.1127 0.1142 0.1401
va: 1.3039 5.8878 1.9585 2.0131 2.0497 2.1210 2.1316 3.4971 3.1064 3.0734 3.1822 2.9673 2.9778 3.7539 3.9458 4.2201 3.9040 3.9659 3.9580 3.9155 4.3825 4.2457 4.0127 3.9748 3.9304 3.8451 3.8442 1.0141 1.0046 1.0666 0.9893 0.9839 1.0168 1.0158 0.9957 0.9933 0.9953 0.9954 0.9905 0.9966
dispcorr: -0.021302700 hartree
energy: -2104.545556185268
dipole: -23.41196 20.91132 -2.50063 -17.70190 13.72072 -3.98118 -1.61300 0.76413 -0.84888
magnitude: 4.77740 au
magnitude: 12.14319 debye
