program: Orca
programVersion: 4.2.1
elementType: Cl S O O O O O N N N N N N C C C C C C C C C C C C C C H H H H H H H H H H H H H
charge: 0
multiplicity: 1
keywords: wb97x-d3
keywords: def2-TZVPP
keywords: def2/J RIJCOSX GRIDX6 NOFINALGRIDX
keywords: grid4 nofinalgrid
keywords: scfconv7
keywords: smallprint printgap noloewdin
keywords: NOSOSCF
formula: C14H13ClN6O5S
InChI: InChI=1S/C14H13ClN6O5S/c1-25-9-7-10(26-2)18-13(17-9)19-14(22)20-27(23,24)12-11(15)16-8-5-3-4-6-21(8)12/h3-7,19-20H,1-2H3
40 atoms
Cl 3.725249 2.759691 -0.365491
S  1.296303 0.857966 1.365653
O  1.156251 -0.041375 2.497357
O  1.43166 2.278391 1.58327
O  0.523864 1.846511 -1.299797
O  -6.007191 0.016048 -1.566791
O  -3.562638 -1.502935 2.075019
N  2.893706 -0.9719 0.084976
N  4.399513 0.295276 -0.981575
N  -0.055662 0.530722 0.457059
N  -1.557229 0.966549 -1.260621
N  -3.773889 0.484443 -1.4266
N  -2.538013 -0.296412 0.425559
C  2.613023 0.349987 0.38358
C  3.99288 -0.950837 -0.743046
C  3.563559 1.07421 -0.312608
C  2.288893 -2.135649 0.45675
C  4.525888 -2.159729 -1.208159
C  2.794519 -3.311347 0.003251
C  3.929124 -3.329539 -0.834814
C  -0.305046 1.167532 -0.732191
C  -2.667624 0.35248 -0.719221
C  -4.859989 -0.079668 -0.91664
C  -3.637095 -0.85211 0.926583
C  -4.861328 -0.775022 0.286988
C  -6.046685 0.721608 -2.805521
C  -2.307016 -1.579067 2.746414
H  1.431727 -2.082395 1.106811
H  5.393356 -2.132845 -1.851113
H  -0.831688 0.000323 0.882986
H  2.312724 -4.23031 0.300894
H  4.322836 -4.274449 -1.18096
H  -1.715046 1.438208 -2.141254
H  -5.754293 -1.226105 0.69358
H  -5.762055 1.76602 -2.684051
H  -7.079536 0.669874 -3.138089
H  -5.406307 0.257101 -3.554382
H  -1.560407 -2.100476 2.146713
H  -2.491484 -2.151981 3.650483
H  -1.939384 -0.591616 3.026525
elementType: Cl S O N C H
totalener: -2104.52456282 hartree
nucrepener: 2928.56001269 hartree
electener: -5033.08457551 hartree
oneelecener: -8711.18965092 hartree
twoeener: 3678.10507541 hartree
cpcmener: -0.04956192 hartree
kineticenergy: 2098.05804251 hartree
xcener: -155.313528510926 hartree
chargesum: 0.0000000
charge: -0.019275 0.851875 -0.512859 -0.488630 -0.475242 -0.300150 -0.298427 0.043595 -0.331436 -0.223427 -0.137600 -0.425209 -0.430644 -0.180146 0.231262 0.174834 0.032255 -0.198161 -0.201826 -0.097817 0.394579 0.373909 0.422527 0.429305 -0.325824 -0.114653 -0.124112 0.151348 0.156432 0.212313 0.171300 0.173016 0.191867 0.147482 0.114061 0.132877 0.114856 0.113743 0.140034 0.111969
qa: -0.0193 0.8519 -0.5129 -0.4886 -0.4752 -0.3002 -0.2984 0.0436 -0.3314 -0.2234 -0.1376 -0.4252 -0.4306 -0.1801 0.2313 0.1748 0.0323 -0.1982 -0.2018 -0.0978 0.3946 0.3739 0.4225 0.4293 -0.3258 -0.1147 -0.1241 0.1513 0.1564 0.2123 0.1713 0.1730 0.1919 0.1475 0.1141 0.1329 0.1149 0.1137 0.1400 0.1120
va: 1.3038 5.8923 1.9593 2.0138 2.0484 2.1210 2.1315 3.4935 3.1066 3.0740 3.1838 2.9671 2.9776 3.7527 3.9460 4.2184 3.9057 3.9665 3.9642 3.9150 4.3811 4.2468 4.0127 3.9751 3.9314 3.8451 3.8453 1.0155 1.0048 1.0660 0.9894 0.9839 1.0168 1.0157 0.9958 0.9932 0.9953 0.9910 0.9965 0.9947
dispcorr: -0.021440580 hartree
energy: -2104.546003401535
dipole: -23.84417 21.22592 -2.61825 -18.17965 14.10799 -4.07165 -2.11894 1.18143 -0.93750
magnitude: 4.93077 au
magnitude: 12.53303 debye
