program: Orca
programVersion: 4.2.1
elementType: Cl S O O O O O N N N N N N C C C C C C C C C C C C C C H H H H H H H H H H H H H
charge: 0
multiplicity: 1
keywords: wb97x-d3
keywords: def2-TZVPP
keywords: def2/J RIJCOSX GRIDX6 NOFINALGRIDX
keywords: grid4 nofinalgrid
keywords: scfconv7
keywords: smallprint printgap noloewdin
keywords: NOSOSCF
formula: C14H13ClN6O5S
InChI: InChI=1S/C14H13ClN6O5S/c1-25-9-7-10(26-2)18-13(17-9)19-14(22)20-27(23,24)12-11(15)16-8-5-3-4-6-21(8)12/h3-7,19-20H,1-2H3
40 atoms
Cl 0.623225 0.742177 -2.440102
S  1.460517 1.53435 0.765592
O  2.174345 1.608458 2.02164
O  1.112095 2.749358 0.060778
O  0.892784 -1.143547 1.785717
O  -5.649827 -1.895038 0.096529
O  -3.747711 2.266028 -0.684564
N  3.42142 -0.304154 -0.023071
N  2.77755 -0.762738 -2.123487
N  -0.003258 0.776566 0.979484
N  -1.302439 -1.129783 1.247512
N  -3.471342 -1.518072 0.68072
N  -2.511765 0.598768 0.273523
C  2.313318 0.474027 -0.299891
C  3.667254 -1.033016 -1.166827
C  1.968049 0.136989 -1.593804
C  4.188231 -0.436983 1.095505
C  4.747509 -1.92395 -1.196428
C  5.235606 -1.301002 1.073902
C  5.524846 -2.05489 -0.081972
C  -0.072215 -0.535201 1.368744
C  -2.478508 -0.649434 0.707335
C  -4.612041 -1.07929 0.165704
C  -3.663264 1.02498 -0.236921
C  -4.78039 0.213285 -0.317246
C  -5.509971 -3.238898 0.552976
C  -2.596014 3.104161 -0.617691
H  3.935261 0.159375 1.954014
H  4.932383 -2.486624 -2.099564
H  -0.850924 1.194786 0.56654
H  5.841383 -1.398418 1.961979
H  6.362718 -2.737174 -0.08066
H  -1.332591 -2.092067 1.558237
H  -5.715983 0.558008 -0.731934
H  -4.751842 -3.778986 -0.013115
H  -6.477228 -3.704967 0.38787
H  -5.268109 -3.281889 1.614231
H  -2.265915 3.255646 0.410138
H  -2.903295 4.059857 -1.032262
H  -1.775271 2.709345 -1.217758
elementType: Cl S O N C H
totalener: -2104.52470662 hartree
nucrepener: 2973.56645350 hartree
electener: -5078.09116012 hartree
oneelecener: -8801.59256230 hartree
twoeener: 3723.50140218 hartree
cpcmener: -0.04100791 hartree
kineticenergy: 2098.06230380 hartree
xcener: -155.315096345158 hartree
chargesum: 0.0000000
charge: -0.030435 0.866990 -0.503183 -0.499799 -0.480193 -0.299697 -0.296586 0.047592 -0.335323 -0.216089 -0.129444 -0.425722 -0.424280 -0.151318 0.233993 0.132628 -0.009745 -0.198893 -0.176728 -0.100105 0.375295 0.373399 0.421094 0.422990 -0.324586 -0.114406 -0.116283 0.188222 0.156279 0.209691 0.170416 0.173024 0.193811 0.147432 0.114650 0.132963 0.114213 0.118828 0.140200 0.099104
qa: -0.0304 0.8670 -0.5032 -0.4998 -0.4802 -0.2997 -0.2966 0.0476 -0.3353 -0.2161 -0.1294 -0.4257 -0.4243 -0.1513 0.2340 0.1326 -0.0097 -0.1989 -0.1767 -0.1001 0.3753 0.3734 0.4211 0.4230 -0.3246 -0.1144 -0.1163 0.1882 0.1563 0.2097 0.1704 0.1730 0.1938 0.1474 0.1146 0.1330 0.1142 0.1188 0.1402 0.0991
va: 1.2983 5.8886 1.9855 1.9886 2.0279 2.1220 2.1331 3.5015 3.1152 3.0610 3.1866 2.9702 2.9761 3.7211 3.9312 4.2555 3.8856 3.9599 3.9025 3.9152 4.3869 4.2436 4.0158 3.9881 3.9327 3.8452 3.8445 1.0032 1.0051 1.0769 0.9898 0.9840 1.0158 1.0156 0.9954 0.9933 0.9953 0.9900 0.9966 0.9964
dispcorr: -0.022565526 hartree
energy: -2104.547272145650
dipole: -10.78309 10.07435 -0.70874 -8.20489 6.23623 -1.96866 6.33602 -6.05755 0.27846
magnitude: 2.11080 au
magnitude: 5.36523 debye
