program: Orca
programVersion: 4.2.1
elementType: Cl S O O O O O N N N N N N C C C C C C C C C C C C C C H H H H H H H H H H H H H
charge: 0
multiplicity: 1
keywords: wb97x-d3
keywords: def2-TZVPP
keywords: def2/J RIJCOSX GRIDX6 NOFINALGRIDX
keywords: grid4 nofinalgrid
keywords: scfconv7
keywords: smallprint printgap noloewdin
keywords: NOSOSCF
formula: C14H13ClN6O5S
InChI: InChI=1S/C14H13ClN6O5S/c1-25-9-7-10(26-2)18-13(17-9)19-14(22)20-27(23,24)12-11(15)16-8-5-3-4-6-21(8)12/h3-7,19-20H,1-2H3
40 atoms
Cl 1.323118 1.20591 -2.671434
S  1.494135 1.395201 0.756153
O  2.04736 1.333004 2.091389
O  1.205768 2.674639 0.148432
O  0.887309 -1.390312 1.35253
O  -3.723581 2.402332 -0.226329
O  -5.792977 -1.799461 0.232755
N  3.513506 -0.40141 0.050591
N  3.313986 -0.460461 -2.181372
N  0.031483 0.601957 0.702676
N  -1.327235 -1.269977 0.930966
N  -2.575765 0.590079 0.322621
N  -3.555458 -1.541649 0.583394
C  2.507296 0.478726 -0.301615
C  3.975965 -0.941497 -1.130154
C  2.431572 0.38481 -1.678946
C  4.031921 -0.759712 1.257992
C  5.018963 -1.877314 -1.099265
C  5.041923 -1.667354 1.29534
C  5.546062 -2.235944 0.107572
C  -0.071771 -0.722282 1.025737
C  -2.534203 -0.696972 0.59379
C  -3.769033 1.105519 0.01891
C  -4.728297 -1.022598 0.272641
C  -4.912476 0.330272 -0.022531
C  -4.930967 3.083357 -0.539554
C  -5.642199 -3.18885 0.513053
H  3.620827 -0.299309 2.138916
H  5.372281 -2.289819 -2.033225
H  -0.819852 1.118529 0.438755
H  5.450554 -1.944031 2.255879
H  6.350748 -2.955996 0.157485
H  -1.367741 -2.2574 1.146902
H  -5.891574 0.713525 -0.266237
H  -4.659652 4.124333 -0.692538
H  -5.650112 3.023015 0.279577
H  -5.384381 2.699273 -1.455179
H  -6.637321 -3.615676 0.420191
H  -5.270844 -3.358946 1.523608
H  -4.975738 -3.673194 -0.200817
elementType: Cl S O N C H
totalener: -2104.52802295 hartree
nucrepener: 2911.29227661 hartree
electener: -5015.82029956 hartree
oneelecener: -8677.89646770 hartree
twoeener: 3662.07616814 hartree
cpcmener: -0.03906842 hartree
kineticenergy: 2098.06434663 hartree
xcener: -155.312525083185 hartree
chargesum: 0.0000000
charge: -0.024948 0.854630 -0.493435 -0.491492 -0.475531 -0.288158 -0.288680 0.045601 -0.328559 -0.205824 -0.134259 -0.393951 -0.432981 -0.143196 0.225777 0.120518 -0.003043 -0.199392 -0.177260 -0.100221 0.387443 0.389696 0.384574 0.366047 -0.280209 -0.132416 -0.116555 0.182067 0.154017 0.205588 0.166523 0.168600 0.190119 0.134714 0.129503 0.122965 0.121905 0.132143 0.113313 0.114369
qa: -0.0249 0.8546 -0.4934 -0.4915 -0.4755 -0.2882 -0.2887 0.0456 -0.3286 -0.2058 -0.1343 -0.3940 -0.4330 -0.1432 0.2258 0.1205 -0.0030 -0.1994 -0.1773 -0.1002 0.3874 0.3897 0.3846 0.3660 -0.2802 -0.1324 -0.1166 0.1821 0.1540 0.2056 0.1665 0.1686 0.1901 0.1347 0.1295 0.1230 0.1219 0.1321 0.1133 0.1144
va: 1.3033 5.9014 1.9969 2.0015 2.0392 2.1152 2.1385 3.4985 3.1140 3.0601 3.1772 2.9718 2.9688 3.7364 3.9486 4.2690 3.8832 3.9627 3.9042 3.9164 4.3812 4.2039 4.0900 4.1095 3.8751 3.8575 3.8489 1.0098 1.0059 1.0771 0.9911 0.9856 1.0189 1.0176 0.9933 0.9860 0.9858 0.9935 0.9960 0.9957
dispcorr: -0.020258769 hartree
energy: -2104.548281723435
dipole: -20.64212 18.06359 -2.57853 -9.87118 7.81345 -2.05773 7.09400 -6.77195 0.32205
magnitude: 3.31463 au
magnitude: 8.42511 debye
