program: Orca
programVersion: 4.2.1
elementType: Cl S O O O O O N N N N N N C C C C C C C C C C C C C C H H H H H H H H H H H H H
charge: 0
multiplicity: 1
keywords: wb97x-d3
keywords: def2-TZVPP
keywords: def2/J RIJCOSX GRIDX6 NOFINALGRIDX
keywords: grid4 nofinalgrid
keywords: scfconv7
keywords: smallprint printgap noloewdin
keywords: NOSOSCF
formula: C14H13ClN6O5S
InChI: InChI=1S/C14H13ClN6O5S/c1-25-9-7-10(26-2)18-13(17-9)19-14(22)20-27(23,24)12-11(15)16-8-5-3-4-6-21(8)12/h3-7,19-20H,1-2H3
40 atoms
Cl 3.540168 -0.209486 3.035115
S  1.238876 1.397308 0.869226
O  1.27391 1.685117 2.281119
O  1.167228 2.472988 -0.102096
O  0.364366 -1.214755 1.944879
O  -3.450572 2.024439 -1.840137
O  -5.995283 -1.576306 -0.388461
N  2.948324 -0.00422 -0.764412
N  4.355843 -0.994492 0.663822
N  -0.089264 0.468921 0.490644
N  -1.648449 -1.198288 0.917913
N  -2.524176 0.431611 -0.49059
N  -3.815336 -1.393065 0.259339
C  2.586606 0.384535 0.51228
C  4.033745 -0.839621 -0.617192
C  3.48122 -0.267833 1.342453
C  2.427452 0.297825 -1.986614
C  4.63477 -1.391988 -1.757192
C  2.998808 -0.240659 -3.094731
C  4.117786 -1.093238 -2.984569
C  -0.401608 -0.677266 1.1779
C  -2.70272 -0.687019 0.192006
C  -3.574111 0.901626 -1.157644
C  -4.851194 -0.918921 -0.417906
C  -4.797984 0.254524 -1.162199
C  -2.204862 2.716087 -1.815837
C  -6.080456 -2.774741 0.378284
H  1.582497 0.965084 -2.030193
H  5.490179 -2.039726 -1.62925
H  -0.819991 0.874507 -0.112495
H  2.582857 0.001992 -4.061227
H  4.563707 -1.508134 -3.877632
H  -1.851195 -2.05591 1.414823
H  -5.652149 0.63664 -1.702002
H  -2.354353 3.611526 -2.413241
H  -1.406135 2.124292 -2.26503
H  -1.926045 3.012889 -0.804051
H  -7.100344 -3.12947 0.254671
H  -5.890263 -2.59185 1.436009
H  -5.38947 -3.535863 0.01578
elementType: Cl S O N C H
totalener: -2104.52711203 hartree
nucrepener: 2927.13899997 hartree
electener: -5031.66611201 hartree
oneelecener: -8708.25757336 hartree
twoeener: 3676.59146135 hartree
cpcmener: -0.04092807 hartree
kineticenergy: 2098.06391551 hartree
xcener: -155.311993807175 hartree
chargesum: 0.0000000
charge: -0.016610 0.847591 -0.472644 -0.504238 -0.449796 -0.289975 -0.291338 0.041297 -0.324447 -0.229867 -0.143405 -0.432394 -0.426150 -0.182306 0.226753 0.177630 0.025486 -0.196634 -0.198776 -0.098937 0.382687 0.373326 0.421926 0.415453 -0.323282 -0.122037 -0.115462 0.149571 0.154806 0.210789 0.167280 0.168981 0.189830 0.145739 0.138711 0.110527 0.111678 0.131929 0.113528 0.112781
qa: -0.0166 0.8476 -0.4726 -0.5042 -0.4498 -0.2900 -0.2913 0.0413 -0.3244 -0.2299 -0.1434 -0.4324 -0.4262 -0.1823 0.2268 0.1776 0.0255 -0.1966 -0.1988 -0.0989 0.3827 0.3733 0.4219 0.4155 -0.3233 -0.1220 -0.1155 0.1496 0.1548 0.2108 0.1673 0.1690 0.1898 0.1457 0.1387 0.1105 0.1117 0.1319 0.1135 0.1128
va: 1.3052 5.9005 2.0341 1.9696 2.0771 2.1409 2.1318 3.4931 3.1096 3.0689 3.1773 2.9752 2.9652 3.7577 3.9540 4.2135 3.9109 3.9687 3.9609 3.9168 4.3923 4.2460 3.9880 4.0242 3.9278 3.8497 3.8490 1.0173 1.0053 1.0655 0.9909 0.9855 1.0186 1.0161 0.9958 0.9911 0.9952 0.9934 0.9959 0.9958
dispcorr: -0.021425268 hartree
energy: -2104.548537301591
dipole: -22.62187 20.36077 -2.26111 -3.08582 2.00897 -1.07685 -19.60932 15.68603 -3.92329
magnitude: 4.65450 au
magnitude: 11.83081 debye
