program: Orca
programVersion: 4.2.1
elementType: Cl S O O O O O N N N N N N C C C C C C C C C C C C C C H H H H H H H H H H H H H
charge: 0
multiplicity: 1
keywords: wb97x-d3
keywords: def2-TZVPP
keywords: def2/J RIJCOSX GRIDX6 NOFINALGRIDX
keywords: grid4 nofinalgrid
keywords: scfconv7
keywords: smallprint printgap noloewdin
keywords: NOSOSCF
formula: C14H13ClN6O5S
InChI: InChI=1S/C14H13ClN6O5S/c1-25-9-7-10(26-2)18-13(17-9)19-14(22)20-27(23,24)12-11(15)16-8-5-3-4-6-21(8)12/h3-7,19-20H,1-2H3
40 atoms
Cl 1.030789 1.389817 -2.529912
S  1.455962 1.479193 0.883603
O  2.119061 1.408767 2.16634
O  1.077578 2.759133 0.327174
O  0.935211 -1.341213 1.521252
O  -3.742768 2.284438 -0.524997
O  -5.647728 -1.923297 -0.060098
N  3.455215 -0.246791 -0.030628
N  3.09541 -0.230826 -2.242916
N  0.018467 0.647373 0.93524
N  -1.273773 -1.27496 1.041881
N  -2.50121 0.539191 0.26437
N  -3.458791 -1.601633 0.498492
C  2.403974 0.617471 -0.276092
C  3.844714 -0.729842 -1.261177
C  2.229924 0.569407 -1.647052
C  4.064284 -0.639147 1.12311
C  4.910109 -1.637079 -1.340862
C  5.09482 -1.52119 1.053323
C  5.52904 -2.027968 -0.18901
C  -0.03699 -0.694777 1.193563
C  -2.460103 -0.743783 0.581344
C  -3.658688 1.011597 -0.187476
C  -4.608801 -1.11741 0.050881
C  -4.781233 0.212449 -0.317726
C  -2.581037 3.103888 -0.424182
C  -5.497182 -3.29584 0.291739
H  3.702077 -0.22823 2.048895
H  5.206376 -2.003827 -2.313083
H  -0.840414 1.106033 0.596054
H  5.573764 -1.826766 1.971772
H  6.352115 -2.727886 -0.224283
H  -1.300401 -2.264505 1.251112
H  -5.722825 0.594006 -0.684622
H  -2.224562 3.177341 0.60388
H  -2.886864 4.091017 -0.760292
H  -1.778836 2.747689 -1.071989
H  -4.744448 -3.790148 -0.322543
H  -6.465559 -3.753119 0.106387
H  -5.238657 -3.417313 1.343776
elementType: Cl S O N C H
totalener: -2104.52835876 hartree
nucrepener: 2958.48438646 hartree
electener: -5063.01274523 hartree
oneelecener: -8771.25176097 hartree
twoeener: 3708.23901574 hartree
cpcmener: -0.03386633 hartree
kineticenergy: 2098.07684078 hartree
xcener: -155.316358746103 hartree
chargesum: 0.0000000
charge: -0.027539 0.853198 -0.491969 -0.489512 -0.466736 -0.289135 -0.291146 0.046682 -0.329516 -0.209328 -0.137228 -0.426692 -0.425732 -0.155515 0.227968 0.132754 0.000541 -0.200073 -0.177401 -0.099237 0.376164 0.373787 0.418690 0.415327 -0.322135 -0.115973 -0.115754 0.180611 0.154661 0.207263 0.166869 0.168972 0.190243 0.145103 0.116043 0.137957 0.099494 0.113388 0.131736 0.113166
qa: -0.0275 0.8532 -0.4920 -0.4895 -0.4667 -0.2891 -0.2911 0.0467 -0.3295 -0.2093 -0.1372 -0.4267 -0.4257 -0.1555 0.2280 0.1328 0.0005 -0.2001 -0.1774 -0.0992 0.3762 0.3738 0.4187 0.4153 -0.3221 -0.1160 -0.1158 0.1806 0.1547 0.2073 0.1669 0.1690 0.1902 0.1451 0.1160 0.1380 0.0995 0.1134 0.1317 0.1132
va: 1.2988 5.9050 1.9951 2.0040 2.0491 2.1431 2.1320 3.4949 3.1149 3.0601 3.1801 2.9790 2.9678 3.7222 3.9455 4.2593 3.8820 3.9625 3.9055 3.9161 4.3900 4.2453 3.9963 4.0250 3.9284 3.8477 3.8497 1.0109 1.0056 1.0751 0.9909 0.9854 1.0183 1.0163 0.9914 0.9971 0.9974 0.9956 0.9935 0.9956
dispcorr: -0.022176796 hartree
energy: -2104.550535558709
dipole: -12.10326 11.21750 -0.88576 -10.34948 8.25385 -2.09563 6.17138 -5.95244 0.21895
magnitude: 2.28565 au
magnitude: 5.80966 debye
