program: Orca
programVersion: 4.2.1
elementType: Cl S O O O O O N N N N N N C C C C C C C C C C C C C C H H H H H H H H H H H H H
charge: 0
multiplicity: 1
keywords: wb97x-d3
keywords: def2-TZVPP
keywords: def2/J RIJCOSX GRIDX6 NOFINALGRIDX
keywords: grid4 nofinalgrid
keywords: scfconv7
keywords: smallprint printgap noloewdin
keywords: NOSOSCF
formula: C14H13ClN6O5S
InChI: InChI=1S/C14H13ClN6O5S/c1-25-9-7-10(26-2)18-13(17-9)19-14(22)20-27(23,24)12-11(15)16-8-5-3-4-6-21(8)12/h3-7,19-20H,1-2H3
40 atoms
Cl 1.227286 1.726233 -2.467638
S  1.461738 1.442801 0.982742
O  2.110462 1.267352 2.25845
O  1.059727 2.745786 0.512471
O  0.926598 -1.451031 1.4512
O  -3.716476 2.231409 -0.604631
O  -5.67929 -1.936791 -0.021598
N  3.469473 -0.213853 -0.017038
N  3.263081 0.061751 -2.232705
N  0.032953 0.578767 0.948969
N  -1.28412 -1.332101 1.003378
N  -2.49369 0.487987 0.213283
N  -3.479681 -1.636149 0.498726
C  2.438201 0.680557 -0.229193
C  3.94123 -0.550842 -1.270355
C  2.358322 0.795095 -1.606327
C  3.995417 -0.74789 1.120169
C  5.013738 -1.448679 -1.381253
C  5.03173 -1.619261 1.016165
C  5.554125 -1.975089 -0.245362
C  -0.025582 -0.770112 1.158775
C  -2.466553 -0.790312 0.553225
C  -3.648717 0.966777 -0.237706
C  -4.627254 -1.142892 0.056602
C  -4.784686 0.180901 -0.339379
C  -2.54376 3.032479 -0.529283
C  -5.535871 -3.293647 0.368044
H  3.553213 -0.451534 2.054835
H  5.372962 -1.694633 -2.369424
H  -0.808542 1.048546 0.597485
H  5.443863 -2.038549 1.921556
H  6.380183 -2.669619 -0.307037
H  -1.318932 -2.321449 1.19805
H  -5.72363 0.567117 -0.704622
H  -1.737563 2.63783 -1.149247
H  -2.184608 3.134593 0.495591
H  -2.833143 4.01098 -0.901613
H  -5.243839 -3.385779 1.414366
H  -4.801002 -3.815141 -0.245741
H  -6.513977 -3.744311 0.223459
totalener: -2104.50262895 hartree
nucrepener: 2949.38435480 hartree
electener: -5053.88698375 hartree
oneelecener: -8752.31046581 hartree
twoeener: 3698.42348206 hartree
kineticenergy: 2098.11820887 hartree
xcener: -155.316465040809 hartree
chargesum: -0.0000000
charge: -0.026883 0.840906 -0.446471 -0.448131 -0.402188 -0.261387 -0.262332 0.032802 -0.275303 -0.213274 -0.164226 -0.426231 -0.406658 -0.179043 0.196480 0.138907 0.016002 -0.184078 -0.149034 -0.084866 0.357742 0.365352 0.397281 0.385349 -0.298110 -0.114826 -0.125395 0.165218 0.135456 0.196035 0.132257 0.134694 0.168251 0.130238 0.095893 0.109756 0.128070 0.108261 0.108825 0.124664
qa: -0.0269 0.8409 -0.4465 -0.4481 -0.4022 -0.2614 -0.2623 0.0328 -0.2753 -0.2133 -0.1642 -0.4262 -0.4067 -0.1790 0.1965 0.1389 0.0160 -0.1841 -0.1490 -0.0849 0.3577 0.3654 0.3973 0.3853 -0.2981 -0.1148 -0.1254 0.1652 0.1355 0.1960 0.1323 0.1347 0.1683 0.1302 0.0959 0.1098 0.1281 0.1083 0.1088 0.1247
va: 1.2946 5.9130 2.0434 2.0514 2.1108 2.1643 2.1521 3.5011 3.1251 3.0722 3.1632 2.9770 2.9729 3.7563 4.0060 4.2273 3.9175 3.9832 3.9198 3.9326 4.3826 4.2425 4.0262 4.0582 3.9367 3.8656 3.8754 1.0228 1.0123 1.0784 1.0029 0.9973 1.0356 1.0214 1.0031 0.9955 0.9971 0.9968 0.9966 0.9940
dispcorr: -0.022014021 hartree
energy: -2104.524642971996
dipole: -12.72455 11.84728 -0.87726 -11.44630 9.89551 -1.55079 5.67274 -5.58947 0.08327
magnitude: 1.78367 au
magnitude: 4.53373 debye
