program: Orca
programVersion: 4.2.1
elementType: S O O O O O N N N N N N N N N N C C C C C C C C C C C C C H H H H H H H H H H H H H H H H
charge: 0
multiplicity: 1
keywords: wb97x-d3
keywords: def2-TZVPP
keywords: def2/J RIJCOSX GRIDX6 NOFINALGRIDX
keywords: grid4 nofinalgrid
keywords: scfconv7
keywords: smallprint printgap noloewdin
keywords: NOSOSCF
formula: C13H16N10O5S
InChI: InChI=1S/C13H16N10O5S/c1-22-11(7(6-14-22)10-18-21-23(2)19-10)29(25,26)20-13(24)17-12-15-8(27-3)5-9(16-12)28-4/h5-6,17,20H,1-4H3
45 atoms
S  -1.957964 0.816746 1.502211
O  -1.785442 -0.342911 2.349034
O  -2.614112 1.990542 2.029633
O  -1.110076 2.812249 -0.453105
O  5.273099 0.881552 -1.680583
O  3.161724 -1.123326 1.933096
N  -3.864534 0.920318 -0.500609
N  -0.429371 1.206821 0.999335
N  -4.324747 0.248215 -1.539681
N  -1.597683 -3.039758 -1.10329
N  -0.321574 -1.639562 0.008546
N  -0.439041 -3.552381 -0.790394
N  1.045263 2.14967 -0.530158
N  0.334674 -2.743231 -0.13033
N  3.156886 1.529009 -1.103596
N  2.096823 0.517191 0.746274
C  -2.786829 0.3075 0.037906
C  -2.546659 -0.836045 -0.709056
C  -3.549656 -0.808487 -1.682608
C  -1.504776 -1.829455 -0.588947
C  -4.535285 2.147877 -0.111964
C  -0.22453 2.104135 -0.017291
C  2.145478 1.354073 -0.273425
C  -0.055231 -4.904234 -1.130317
C  4.218743 0.763539 -0.890935
C  3.161919 -0.254397 0.937027
C  4.284728 -0.175596 0.131244
C  5.236151 1.821883 -2.7515
C  2.037531 -1.176025 2.80957
H  -3.720867 -1.512425 -2.480763
H  0.331539 0.540657 1.201601
H  -3.835377 2.975109 -0.075362
H  -5.030342 2.036381 0.848056
H  -5.281855 2.349583 -0.871243
H  -0.734206 -5.606859 -0.65634
H  0.953481 -5.071786 -0.770903
H  -0.086507 -5.033065 -2.20801
H  5.15328 -0.797588 0.289098
H  6.196528 1.732963 -3.251166
H  5.114452 2.842033 -2.389321
H  4.441578 1.593567 -3.460859
H  1.125955 -1.457633 2.283925
H  1.887311 -0.228388 3.326763
H  2.272947 -1.94372 3.54112
H  1.156602 2.798679 -1.298159
elementType: S O N C H
totalener: -1826.99133342 hartree
nucrepener: 3229.66087871 hartree
electener: -5056.65221213 hartree
oneelecener: -8924.99475536 hartree
twoeener: 3868.34254323 hartree
cpcmener: -0.04547272 hartree
kineticenergy: 1820.57736821 hartree
xcener: -150.533659962673 hartree
chargesum: 0.0000000
charge: 0.880749 -0.497254 -0.496290 -0.481679 -0.301624 -0.298827 0.180528 -0.193212 -0.318348 -0.291020 -0.212470 0.274172 -0.133700 -0.203984 -0.423498 -0.411843 -0.122023 -0.108709 -0.071482 0.290102 -0.155492 0.379304 0.361230 -0.134623 0.420001 0.419261 -0.324814 -0.113516 -0.121009 0.163779 0.221802 0.123953 0.132610 0.115135 0.135354 0.121852 0.133562 0.146520 0.132138 0.114246 0.113893 0.095983 0.124173 0.142184 0.192885
qa: 0.8807 -0.4973 -0.4963 -0.4817 -0.3016 -0.2988 0.1805 -0.1932 -0.3183 -0.2910 -0.2125 0.2742 -0.1337 -0.2040 -0.4235 -0.4118 -0.1220 -0.1087 -0.0715 0.2901 -0.1555 0.3793 0.3612 -0.1346 0.4200 0.4193 -0.3248 -0.1135 -0.1210 0.1638 0.2218 0.1240 0.1326 0.1151 0.1354 0.1219 0.1336 0.1465 0.1321 0.1142 0.1139 0.0960 0.1242 0.1422 0.1929
va: 5.8743 1.9912 2.0022 2.0266 2.1194 2.1213 3.3645 3.0826 2.9091 2.9281 2.9283 3.3981 3.1888 2.8258 2.9710 2.9584 4.0350 3.7752 4.1002 4.0428 3.8516 4.3874 4.2532 3.8615 4.0149 3.9773 3.9481 3.8460 3.8403 1.0087 1.0602 1.0019 0.9909 1.0099 0.9906 1.0004 0.9913 1.0163 0.9936 0.9952 0.9956 0.9985 0.9920 0.9938 1.0165
dispcorr: -0.026005866 hartree
energy: -1827.017339286964
dipole: 9.26834 -6.95113 2.31721 -4.80445 2.84310 -1.96135 -5.70599 3.81779 -1.88821
magnitude: 3.57514 au
magnitude: 9.08729 debye
