program: Orca
programVersion: 4.2.1
elementType: S O O O O O N N N N N N N N N N C C C C C C C C C C C C C H H H H H H H H H H H H H H H H
charge: 0
multiplicity: 1
keywords: wb97x-d3
keywords: def2-TZVPP
keywords: def2/J RIJCOSX GRIDX6 NOFINALGRIDX
keywords: grid4 nofinalgrid
keywords: scfconv7
keywords: smallprint printgap noloewdin
keywords: NOSOSCF
formula: C13H16N10O5S
InChI: InChI=1S/C13H16N10O5S/c1-22-11(7(6-14-22)10-18-21-23(2)19-10)29(25,26)20-13(24)17-12-15-8(27-3)5-9(16-12)28-4/h5-6,17,20H,1-4H3
45 atoms
S  -2.23502 0.992703 -1.427211
O  -2.90173 2.248272 -1.683763
O  -2.192132 -0.014398 -2.463011
O  -1.135564 2.671778 0.694915
O  4.900855 -0.255239 1.511802
O  2.66772 -1.214617 -2.43973
N  -4.030363 0.675469 0.648465
N  -0.652029 1.257025 -1.013805
N  -4.219789 0.02379 1.782278
N  -0.258873 -1.695308 1.710228
N  -0.58056 -1.867913 -0.459666
N  0.688773 -2.364017 1.11068
N  0.953852 1.827138 0.570825
N  0.523034 -2.476398 -0.173944
N  2.931631 0.80517 1.038464
N  1.804638 0.319342 -0.97811
C  -2.877777 0.29995 0.056901
C  -2.29294 -0.662634 0.86366
C  -3.185511 -0.779336 1.933461
C  -1.051544 -1.389121 0.701075
C  -5.007359 1.666466 0.234856
C  -0.330963 1.972614 0.11686
C  1.936966 0.937018 0.182068
C  1.825092 -2.927168 1.806371
C  3.877191 -0.0617 0.698915
C  2.753547 -0.557099 -1.299103
C  3.842718 -0.797882 -0.479101
C  4.959805 0.470084 2.738933
C  1.565571 -0.963078 -3.31004
H  -3.111799 -1.430189 2.789619
H  0.08009 0.657589 -1.424028
H  -4.601057 2.669929 0.322384
H  -5.857639 1.568028 0.899903
H  -5.337485 1.486695 -0.783225
H  2.3458 -2.147706 2.355221
H  2.488853 -3.370779 1.072824
H  1.486762 -3.690181 2.502034
H  4.613797 -1.507859 -0.739298
H  5.008655 1.544951 2.569718
H  5.873372 0.14327 3.227125
H  4.109839 0.243318 3.381915
H  1.533873 0.078711 -3.628511
H  0.616042 -1.239386 -2.851545
H  1.730324 -1.593362 -4.179154
H  1.142864 2.323174 1.432184
elementType: S O N C H
totalener: -1826.98927901 hartree
nucrepener: 3340.58953822 hartree
electener: -5167.57881723 hartree
oneelecener: -9145.90716844 hartree
twoeener: 3978.32835121 hartree
cpcmener: -0.05039128 hartree
kineticenergy: 1820.57554549 hartree
xcener: -150.532339186709 hartree
chargesum: -0.0000000
charge: 0.872447 -0.488657 -0.488554 -0.459270 -0.295833 -0.290112 0.163446 -0.204531 -0.315853 -0.276686 -0.195903 0.242057 -0.126662 -0.143496 -0.395709 -0.413973 -0.102591 -0.058090 -0.071693 0.179672 -0.154313 0.350225 0.331272 -0.165343 0.392499 0.414649 -0.315243 -0.112485 -0.120090 0.165647 0.220749 0.127245 0.115615 0.130786 0.134452 0.134824 0.153271 0.141624 0.116441 0.134084 0.111697 0.126128 0.098034 0.141277 0.196944
qa: 0.8724 -0.4887 -0.4886 -0.4593 -0.2958 -0.2901 0.1634 -0.2045 -0.3159 -0.2767 -0.1959 0.2421 -0.1267 -0.1435 -0.3957 -0.4140 -0.1026 -0.0581 -0.0717 0.1797 -0.1543 0.3502 0.3313 -0.1653 0.3925 0.4146 -0.3152 -0.1125 -0.1201 0.1656 0.2207 0.1272 0.1156 0.1308 0.1345 0.1348 0.1533 0.1416 0.1164 0.1341 0.1117 0.1261 0.0980 0.1413 0.1969
va: 5.8636 2.0083 1.9889 2.0454 2.1161 2.1252 3.3906 3.0685 2.9059 2.8699 2.9221 3.4212 3.1920 2.8397 2.9392 2.9306 4.0494 3.6273 4.1045 4.0621 3.8614 4.4191 4.2471 3.8665 3.9915 3.9524 3.8965 3.8469 3.8340 1.0062 1.0643 0.9939 1.0100 0.9947 0.9832 0.9959 0.9933 1.0197 0.9949 0.9933 0.9931 0.9892 1.0000 0.9944 1.0138
dispcorr: -0.030978775 hartree
energy: -1827.020257782190
dipole: 11.63905 -8.34613 3.29292 -3.99736 2.61538 -1.38198 6.46468 -4.39419 2.07048
magnitude: 4.12796 au
magnitude: 10.49245 debye
