program: Orca
programVersion: 4.2.1
elementType: S O O O O O N N N N N N N N N N C C C C C C C C C C C C C H H H H H H H H H H H H H H H H
charge: 0
multiplicity: 1
keywords: wb97x-d3
keywords: def2-TZVPP
keywords: def2/J RIJCOSX GRIDX6 NOFINALGRIDX
keywords: grid4 nofinalgrid
keywords: scfconv7
keywords: smallprint printgap noloewdin
keywords: NOSOSCF
formula: C13H16N10O5S
InChI: InChI=1S/C13H16N10O5S/c1-22-11(7(6-14-22)10-18-21-23(2)19-10)29(25,26)20-13(24)17-12-15-8(27-3)5-9(16-12)28-4/h5-6,17,20H,1-4H3
45 atoms
S  -2.08191 0.825492 -1.336552
O  -2.790917 1.994822 -1.801087
O  -1.974378 -0.333075 -2.195958
O  -1.075972 2.820081 0.543884
O  5.353832 0.806073 1.287445
O  2.979827 -1.094224 -2.217935
N  -3.810304 0.907261 0.823544
N  -0.517046 1.226227 -0.971569
N  -4.178501 0.223267 1.891074
N  -1.461039 -3.032141 1.210033
N  -0.287761 -1.602534 0.021684
N  -0.320482 -3.523765 0.809139
N  1.077567 2.153536 0.443266
N  0.392053 -2.698018 0.101086
N  3.215024 1.496271 0.862593
N  2.021027 0.536161 -0.931914
C  -2.775737 0.307868 0.193358
C  -2.464533 -0.837816 0.909883
C  -3.384549 -0.826694 1.962271
C  -1.422338 -1.81616 0.701025
C  -4.518921 2.132867 0.502177
C  -0.229474 2.114343 0.0330
C  2.148152 1.350489 0.098974
C  0.10524 -4.872256 1.108407
C  4.248601 0.720239 0.566094
C  3.058931 -0.246532 -1.20685
C  4.233072 -0.199853 -0.475205
C  5.403748 1.725139 2.375841
C  1.791395 -1.125327 -3.006127
H  -3.482259 -1.537376 2.766943
H  0.225408 0.562404 -1.239723
H  -3.829098 2.964616 0.409731
H  -5.198367 2.326223 1.324542
H  -5.094692 2.023472 -0.412186
H  -0.582275 -5.58206 0.657179
H  0.128631 -5.017042 2.18435
H  1.09883 -5.014583 0.698609
H  5.079491 -0.831526 -0.700689
H  6.390834 1.605836 2.813551
H  4.649524 1.500321 3.129203
H  5.283635 2.754754 2.040694
H  0.923996 -1.425245 -2.41894
H  1.969855 -1.870991 -3.775671
H  1.599194 -0.164031 -3.482488
H  1.250943 2.791251 1.20921
elementType: S O N C H
totalener: -1826.99117781 hartree
nucrepener: 3234.32202180 hartree
electener: -5061.31319961 hartree
oneelecener: -8934.32508903 hartree
twoeener: 3873.01188942 hartree
cpcmener: -0.04537604 hartree
kineticenergy: 1820.57675560 hartree
xcener: -150.533227318032 hartree
chargesum: -0.0000000
charge: 0.883226 -0.496882 -0.498854 -0.480530 -0.301194 -0.298229 0.180927 -0.192398 -0.318299 -0.290636 -0.213216 0.272891 -0.134436 -0.203266 -0.422609 -0.410643 -0.121312 -0.108141 -0.070246 0.287843 -0.155543 0.377431 0.359823 -0.133983 0.419553 0.418211 -0.324787 -0.113766 -0.120101 0.163514 0.220347 0.125003 0.114806 0.132410 0.135413 0.133150 0.122009 0.146496 0.131947 0.114132 0.114179 0.096548 0.141951 0.123668 0.193593
qa: 0.8832 -0.4969 -0.4989 -0.4805 -0.3012 -0.2982 0.1809 -0.1924 -0.3183 -0.2906 -0.2132 0.2729 -0.1344 -0.2033 -0.4226 -0.4106 -0.1213 -0.1081 -0.0702 0.2878 -0.1555 0.3774 0.3598 -0.1340 0.4196 0.4182 -0.3248 -0.1138 -0.1201 0.1635 0.2203 0.1250 0.1148 0.1324 0.1354 0.1331 0.1220 0.1465 0.1319 0.1141 0.1142 0.0965 0.1420 0.1237 0.1936
va: 5.8711 2.0017 1.9900 2.0273 2.1192 2.1207 3.3646 3.0831 2.9093 2.9280 2.9273 3.3994 3.1888 2.8239 2.9708 2.9561 4.0308 3.7776 4.0986 4.0441 3.8513 4.3891 4.2544 3.8617 4.0141 3.9776 3.9485 3.8461 3.8399 1.0087 1.0619 1.0016 1.0098 0.9911 0.9904 0.9917 1.0004 1.0163 0.9937 0.9956 0.9953 0.9988 0.9938 0.9918 1.0160
dispcorr: -0.026130715 hartree
energy: -1827.017308525834
dipole: 9.70971 -7.23541 2.47430 -4.92632 2.94766 -1.97866 4.98269 -3.29228 1.69040
magnitude: 3.59092 au
magnitude: 9.12739 debye
